{"text_format":"1","workbook":"xlsx","n_sheets":6,"sheets":["Votos","Apuram","HONDT","Cálculo","Gr_CM","Mandatos"],"not_rendered":{"charts":6,"images":0,"macros":1,"external_links":0,"defined_names":19,"comments":0,"pivot_tables":0},"unopened":[],"bounds":{"document_bytes":16777216,"sheet_cells":100000,"rows_first":2000,"rows_last":500,"rows_between":2000,"halvings":0,"cell_chars":16384,"cell_head_chars":4096},"cells_cut":0,"cells_raw":0,"read":"whole","date_system":"1900"}

{"sheet":"Votos","index":0,"n_rows":188,"n_cols":38,"rows_kept":188,"cut":false,"hidden":false,"merged":[]}
["DataEleicao","TipoEleicao","Freguesia","Local","Mesa","Inscritos","Votantes","Expressos","Brancos","Nulos","Abstencao","TipoEleicaoID","EleicaoID","FreguesiaID","LocalID","MesaID","Apurado","Seccao","L","MPT","PCTP/MRPP","R.I.R.","B.E.","NC","E","A","ADN","PCP-PEV","PPD/PSD","PS","JPP","PAN","IL","PTP","VP","CDS-PP","MAS","CH"]
["2022-01-30","Legislativas","Barcarena","CERCI Oeiras","BARC_01",755,533,523,7,3,222,5,36,14,162,1036,1,1,19,0,0,0,40,1,0,0,1,25,143,176,0,12,72,0,1,6,1,26]
["2022-01-30","Legislativas","Barcarena","CERCI Oeiras","BARC_02",756,531,524,4,3,225,5,36,14,162,1037,1,2,15,1,3,2,25,0,0,0,0,21,152,202,1,17,41,0,0,6,0,38]
["2022-01-30","Legislativas","Barcarena","CERCI Oeiras","BARC_03",749,518,508,9,1,231,5,36,14,162,1038,1,3,17,1,1,1,20,0,0,0,2,12,138,178,0,18,77,0,1,5,1,36]
["2022-01-30","Legislativas","Barcarena","EB1 Visconde de Leceia","BARC_04",641,444,432,7,5,197,5,36,14,163,1039,1,4,10,0,2,1,15,0,1,1,4,21,131,140,0,10,56,0,0,7,1,32]
["2022-01-30","Legislativas","Barcarena","EB1 Visconde de Leceia","BARC_05",639,468,459,7,2,171,5,36,14,163,1040,1,5,10,0,2,1,10,1,0,1,1,26,141,169,0,12,41,0,0,11,0,33]
["2022-01-30","Legislativas","Barcarena","EB1 Visconde de Leceia","BARC_06",659,466,456,9,1,193,5,36,14,163,1041,1,6,11,0,1,1,14,0,1,0,2,25,124,162,0,9,67,0,0,5,0,34]
["2022-01-30","Legislativas","Barcarena","EB1 Jorge Mineiro - Queluz de Baixo","BARC_07",764,527,516,6,5,237,5,36,14,164,1042,1,7,8,1,3,2,38,1,0,0,0,24,123,222,1,10,32,0,1,6,1,43]
["2022-01-30","Legislativas","Barcarena","EB1 Jorge Mineiro - Queluz de Baixo","BARC_08",758,496,486,9,1,262,5,36,14,164,1043,1,8,5,3,2,1,23,0,0,0,0,26,121,215,0,11,31,0,0,5,1,42]
["2022-01-30","Legislativas","Barcarena","EB1 Jorge Mineiro - Queluz de Baixo","BARC_09",758,493,488,3,2,265,5,36,14,164,1044,1,9,2,0,2,0,24,0,0,0,1,26,99,279,0,8,20,0,0,6,0,21]
["2022-01-30","Legislativas","Barcarena","EB1 Jorge Mineiro - Queluz de Baixo","BARC_10",766,486,476,7,3,280,5,36,14,164,1045,1,10,14,2,2,4,35,0,0,1,1,22,93,192,0,16,41,0,1,4,2,46]
["2022-01-30","Legislativas","Barcarena","EB1 Santo António de Tercena","BARC_11",764,556,545,7,4,208,5,36,14,165,1046,1,11,8,1,2,2,33,1,1,1,2,29,127,225,0,19,43,0,1,9,1,40]
["2022-01-30","Legislativas","Barcarena","EB1 Santo António de Tercena","BARC_12",763,522,522,0,0,241,5,36,14,165,1047,1,12,10,1,4,1,29,2,0,1,1,30,111,225,0,15,46,0,0,6,0,40]
["2022-01-30","Legislativas","Barcarena","EB1 Santo António de Tercena","BARC_13",770,542,526,10,6,228,5,36,14,165,1048,1,13,10,1,2,2,31,0,1,1,0,38,121,214,0,12,36,0,0,10,1,46]
["2022-01-30","Legislativas","Barcarena","EB1 Santo António de Tercena","BARC_14",774,531,518,7,6,243,5,36,14,165,1049,1,14,12,0,6,1,20,0,0,0,0,25,149,221,0,12,33,0,0,13,1,25]
["2022-01-30","Legislativas","Barcarena","EB1 Santo António de Tercena","BARC_15",768,534,522,7,5,234,5,36,14,165,1050,1,15,17,1,1,2,27,2,0,0,2,30,108,184,0,21,66,0,2,4,1,54]
["2022-01-30","Legislativas","Barcarena","EB1/JI de São Bento - Valejas","BARC_16",501,347,344,2,1,154,5,36,14,166,1051,1,16,6,1,0,0,17,0,0,0,0,15,82,145,1,13,31,1,0,5,0,27]
["2022-01-30","Legislativas","Barcarena","EB1/JI de São Bento - Valejas","BARC_17",498,355,346,3,6,143,5,36,14,166,1052,1,17,10,0,3,2,14,1,2,1,0,20,59,167,1,9,28,0,0,4,1,24]
["2022-01-30","Legislativas","Porto Salvo","EB1/JI de Porto Salvo","PSALVO_01",730,455,443,5,7,275,5,36,15,167,1053,1,1,12,2,4,0,22,1,0,0,2,29,89,219,1,8,24,0,0,4,0,26]
["2022-01-30","Legislativas","Porto Salvo","EB1/JI de Porto Salvo","PSALVO_02",728,416,402,8,6,312,5,36,15,167,1054,1,2,12,0,2,2,14,0,0,1,2,13,85,188,1,12,24,0,1,10,0,35]
["2022-01-30","Legislativas","Porto Salvo","EB1/JI de Porto Salvo","PSALVO_03",728,420,414,3,3,308,5,36,15,167,1055,1,3,8,0,2,1,22,0,0,1,0,25,87,208,0,6,21,0,0,3,1,29]
["2022-01-30","Legislativas","Porto Salvo","EB1/JI de Porto Salvo","PSALVO_04",723,449,443,3,3,274,5,36,15,167,1056,1,4,6,0,1,2,18,0,0,2,1,26,95,236,1,10,23,0,0,5,0,17]
["2022-01-30","Legislativas","Porto Salvo","EB1/JI de Porto Salvo","PSALVO_05",728,396,383,7,6,332,5,36,15,167,1057,1,5,10,2,1,1,25,1,1,0,0,19,82,160,0,10,34,0,1,5,0,31]
["2022-01-30","Legislativas","Porto Salvo","Pavilhão Leões de Porto Salvo","PSALVO_06",712,448,434,9,5,264,5,36,15,168,1058,1,6,4,0,2,4,20,0,0,1,2,10,81,240,1,10,26,0,0,9,0,24]
["2022-01-30","Legislativas","Porto Salvo","Pavilhão Leões de Porto Salvo","PSALVO_07",718,446,435,8,3,272,5,36,15,168,1059,1,7,11,1,0,0,29,1,1,0,0,14,82,222,0,13,28,0,0,7,1,25]
["2022-01-30","Legislativas","Porto Salvo","Pavilhão Leões de Porto Salvo","PSALVO_08",718,407,394,5,8,311,5,36,15,168,1060,1,8,10,0,1,0,25,0,0,1,0,15,73,183,1,12,36,0,0,5,0,32]
["2022-01-30","Legislativas","Porto Salvo","Pavilhão Leões de Porto Salvo","PSALVO_09",715,430,421,4,5,285,5,36,15,168,1061,1,9,8,1,0,0,22,0,0,0,0,24,84,204,0,1,28,0,0,4,0,45]
["2022-01-30","Legislativas","Porto Salvo","Pavilhão Leões de Porto Salvo","PSALVO_10",708,435,425,5,5,273,5,36,15,168,1062,1,10,5,0,1,1,19,0,0,0,1,16,91,249,1,3,18,0,1,3,2,14]
["2022-01-30","Legislativas","Porto Salvo","Pavilhão Leões de Porto Salvo","PSALVO_11",709,441,429,9,3,268,5,36,15,168,1063,1,11,9,1,2,3,28,0,3,0,1,10,97,180,0,19,38,0,0,7,3,28]
["2022-01-30","Legislativas","Porto Salvo","Pavilhão Leões de Porto Salvo","PSALVO_12",719,366,357,7,2,353,5,36,15,168,1064,1,12,11,0,2,1,17,0,0,1,1,12,63,164,0,14,35,0,0,4,0,32]
["2022-01-30","Legislativas","Porto Salvo","EB 2,3/S Aquilino Ribeiro","PSALVO_13",646,500,489,10,1,146,5,36,15,169,1065,1,13,17,2,0,4,31,0,0,0,1,16,143,154,1,14,59,0,0,6,0,41]
["2022-01-30","Legislativas","Porto Salvo","EB 2,3/S Aquilino Ribeiro","PSALVO_14",637,472,464,7,1,165,5,36,15,169,1066,1,14,9,0,1,1,22,0,0,0,3,14,127,165,0,15,57,0,2,9,1,38]
["2022-01-30","Legislativas","Porto Salvo","EB 2,3/S Aquilino Ribeiro","PSALVO_15",640,491,480,10,1,149,5,36,15,169,1067,1,15,18,1,0,2,22,1,0,0,4,11,132,152,1,15,81,1,1,4,0,34]
["2022-01-30","Legislativas","Porto Salvo","Grupo Cultural de Vila Fria","PSALVO_16",547,411,400,8,3,136,5,36,15,170,1068,1,16,12,2,0,2,30,1,0,0,3,21,91,151,0,12,37,0,1,6,1,30]
["2022-01-30","Legislativas","Porto Salvo","Grupo Cultural de Vila Fria","PSALVO_17",553,388,376,8,4,165,5,36,15,170,1069,1,17,9,0,1,0,19,0,0,1,4,20,92,161,0,10,30,1,0,4,0,24]
["2022-01-30","Legislativas","Porto Salvo","Centro Cultural da Lage","PSALVO_18",468,256,249,1,6,212,5,36,15,171,1070,1,18,2,0,1,0,11,0,0,2,0,8,22,164,0,6,7,0,0,1,0,25]
["2022-01-30","Legislativas","Porto Salvo","Centro Cultural da Lage","PSALVO_19",464,257,252,0,5,207,5,36,15,171,1071,1,19,3,0,4,1,6,0,0,1,3,12,28,166,1,2,13,1,0,1,1,9]
["2022-01-30","Legislativas","União das Freguesias de Algés, Linda-a-Velha e Cruz Quebrada-Dafundo","Escola Secundária de Miraflores","UFALCQD_01",951,654,646,7,1,297,5,36,11,172,1072,1,1,18,1,0,0,37,0,0,0,3,32,181,253,0,20,67,0,0,15,0,19]
["2022-01-30","Legislativas","União das Freguesias de Algés, Linda-a-Velha e Cruz Quebrada-Dafundo","Escola Secundária de Miraflores","UFALCQD_02",956,620,615,1,4,336,5,36,11,172,1073,1,2,31,2,0,0,35,0,0,1,0,36,171,213,0,17,59,0,0,11,0,39]
["2022-01-30","Legislativas","União das Freguesias de Algés, Linda-a-Velha e Cruz Quebrada-Dafundo","Escola Secundária de Miraflores","UFALCQD_03",956,608,607,1,0,348,5,36,11,172,1074,1,3,26,1,3,0,30,0,0,1,3,31,163,219,0,15,64,0,0,11,1,39]
["2022-01-30","Legislativas","União das Freguesias de Algés, Linda-a-Velha e Cruz Quebrada-Dafundo","Escola Secundária de Miraflores","UFALCQD_04",960,584,572,5,7,376,5,36,11,172,1075,1,4,24,2,4,0,33,0,0,1,2,27,154,203,0,6,76,1,0,10,0,29]
["2022-01-30","Legislativas","União das Freguesias de Algés, Linda-a-Velha e Cruz Quebrada-Dafundo","Escola Secundária de Miraflores","UFALCQD_05",946,613,601,8,4,333,5,36,11,172,1076,1,5,33,0,2,1,39,1,0,0,4,26,166,187,1,11,84,0,0,14,3,29]
["2022-01-30","Legislativas","União das Freguesias de Algés, Linda-a-Velha e Cruz Quebrada-Dafundo","Escola Secundária de Miraflores","UFALCQD_06",956,664,654,8,2,292,5,36,11,172,1077,1,6,31,0,1,1,36,2,0,0,1,33,214,185,0,6,94,0,1,15,0,34]
["2022-01-30","Legislativas","União das Freguesias de Algés, Linda-a-Velha e Cruz Quebrada-Dafundo","Escola Secundária de Miraflores","UFALCQD_13",956,609,596,11,2,347,5,36,11,172,1084,1,13,37,0,1,3,32,0,0,0,2,18,155,194,0,21,88,0,0,10,0,35]
["2022-01-30","Legislativas","União das Freguesias de Algés, Linda-a-Velha e Cruz Quebrada-Dafundo","Escola Secundária de Miraflores","UFALCQD_07",958,603,595,6,2,355,5,36,11,172,1078,1,7,19,1,2,0,19,1,0,0,3,30,171,200,1,12,78,0,0,14,1,43]
["2022-01-30","Legislativas","União das Freguesias de Algés, Linda-a-Velha e Cruz Quebrada-Dafundo","Escola Secundária de Miraflores","UFALCQD_08",947,637,633,3,1,310,5,36,11,172,1079,1,8,14,1,2,0,19,1,0,0,2,26,191,261,0,13,53,1,0,14,0,35]
["2022-01-30","Legislativas","União das Freguesias de Algés, Linda-a-Velha e Cruz Quebrada-Dafundo","Escola Secundária de Miraflores","UFALCQD_09",941,589,580,7,2,352,5,36,11,172,1080,1,9,14,0,0,0,21,3,0,0,0,23,178,277,0,8,22,0,0,14,1,19]
["2022-01-30","Legislativas","União das Freguesias de Algés, Linda-a-Velha e Cruz Quebrada-Dafundo","Escola Secundária de Miraflores","UFALCQD_10",946,615,607,2,6,331,5,36,11,172,1081,1,10,20,1,2,1,19,0,0,0,3,19,213,197,0,14,76,0,0,20,1,21]
["2022-01-30","Legislativas","União das Freguesias de Algés, Linda-a-Velha e Cruz Quebrada-Dafundo","Escola Secundária de Miraflores","UFALCQD_11",957,644,635,5,4,313,5,36,11,172,1082,1,11,29,0,0,3,31,0,1,1,3,23,160,221,0,19,95,0,1,8,1,39]
["2022-01-30","Legislativas","União das Freguesias de Algés, Linda-a-Velha e Cruz Quebrada-Dafundo","Escola Secundária de Miraflores","UFALCQD_12",960,643,637,4,2,317,5,36,11,172,1083,1,12,38,2,1,1,40,3,0,3,1,34,147,200,0,11,99,1,1,14,2,39]
["2022-01-30","Legislativas","União das Freguesias de Algés, Linda-a-Velha e Cruz Quebrada-Dafundo","Pavilhão Celorico Moreira","UFALCQD_14",793,626,619,4,3,167,5,36,11,173,1085,1,14,23,0,0,0,23,0,1,0,2,19,242,155,0,11,87,0,0,25,2,29]
["2022-01-30","Legislativas","União das Freguesias de Algés, Linda-a-Velha e Cruz Quebrada-Dafundo","Pavilhão Celorico Moreira","UFALCQD_15",800,612,605,6,1,188,5,36,11,173,1086,1,15,9,0,1,2,24,0,1,0,0,21,234,145,0,18,89,0,2,22,0,37]
["2022-01-30","Legislativas","União das Freguesias de Algés, Linda-a-Velha e Cruz Quebrada-Dafundo","Pavilhão Celorico Moreira","UFALCQD_16",792,616,608,3,5,176,5,36,11,173,1087,1,16,24,0,1,0,22,0,0,0,2,26,216,134,1,9,114,0,0,31,0,28]
["2022-01-30","Legislativas","União das Freguesias de Algés, Linda-a-Velha e Cruz Quebrada-Dafundo","Pavilhão Celorico Moreira","UFALCQD_17",795,625,620,3,2,170,5,36,11,173,1088,1,17,23,0,0,1,16,1,0,0,0,21,255,147,0,3,89,0,1,18,0,45]
["2022-01-30","Legislativas","União das Freguesias de Algés, Linda-a-Velha e Cruz Quebrada-Dafundo","Pavilhão Celorico Moreira","UFALCQD_18",795,616,612,3,1,179,5,36,11,173,1089,1,18,19,0,1,2,27,1,0,0,0,15,261,143,0,7,83,0,0,29,1,23]
["2022-01-30","Legislativas","União das Freguesias de Algés, Linda-a-Velha e Cruz Quebrada-Dafundo","Pavilhão Celorico Moreira","UFALCQD_19",803,634,632,1,1,169,5,36,11,173,1090,1,19,14,0,0,0,10,0,0,0,0,18,282,158,0,5,74,0,1,38,1,31]
["2022-01-30","Legislativas","União das Freguesias de Algés, Linda-a-Velha e Cruz Quebrada-Dafundo","Pavilhão Celorico Moreira","UFALCQD_20",799,632,626,3,3,167,5,36,11,173,1091,1,20,27,0,0,1,17,2,0,0,1,9,238,127,0,13,130,0,0,27,0,34]
["2022-01-30","Legislativas","União das Freguesias de Algés, Linda-a-Velha e Cruz Quebrada-Dafundo","Pavilhão Celorico Moreira","UFALCQD_21",800,648,634,13,1,152,5,36,11,173,1092,1,21,20,0,1,0,17,0,0,0,2,13,254,141,0,7,125,0,0,32,0,22]
["2022-01-30","Legislativas","União das Freguesias de Algés, Linda-a-Velha e Cruz Quebrada-Dafundo","Escola Secundária Professor José Augusto Lucas","UFALCQD_22",817,518,513,3,2,299,5,36,11,174,1093,1,22,14,0,1,0,29,0,1,1,4,20,141,204,0,11,45,0,0,16,0,26]
["2022-01-30","Legislativas","União das Freguesias de Algés, Linda-a-Velha e Cruz Quebrada-Dafundo","Escola Secundária Professor José Augusto Lucas","UFALCQD_23",806,588,579,8,1,218,5,36,11,174,1094,1,23,24,0,3,1,32,0,0,0,0,19,164,241,0,19,48,0,0,5,0,23]
["2022-01-30","Legislativas","União das Freguesias de Algés, Linda-a-Velha e Cruz Quebrada-Dafundo","Escola Secundária Professor José Augusto Lucas","UFALCQD_24",810,515,507,8,0,295,5,36,11,174,1095,1,24,11,0,0,2,22,1,0,0,0,33,150,215,0,2,33,0,0,15,0,23]
["2022-01-30","Legislativas","União das Freguesias de Algés, Linda-a-Velha e Cruz Quebrada-Dafundo","Escola Secundária Professor José Augusto Lucas","UFALCQD_25",811,539,526,9,4,272,5,36,11,174,1096,1,25,20,0,1,1,29,0,0,0,2,26,141,209,0,12,44,0,0,8,0,33]
["2022-01-30","Legislativas","União das Freguesias de Algés, Linda-a-Velha e Cruz Quebrada-Dafundo","Escola Secundária Professor José Augusto Lucas","UFALCQD_26",811,542,533,7,2,269,5,36,11,174,1097,1,26,19,0,1,1,36,0,0,0,2,18,133,220,0,14,55,0,2,9,3,20]
["2022-01-30","Legislativas","União das Freguesias de Algés, Linda-a-Velha e Cruz Quebrada-Dafundo","Escola Secundária Professor José Augusto Lucas","UFALCQD_27",808,486,480,3,3,322,5,36,11,174,1098,1,27,16,0,3,4,17,0,0,0,3,21,140,184,0,7,48,0,0,8,0,29]
["2022-01-30","Legislativas","União das Freguesias de Algés, Linda-a-Velha e Cruz Quebrada-Dafundo","Escola Secundária Professor José Augusto Lucas","UFALCQD_40",810,551,539,9,3,259,5,36,11,174,1111,1,40,22,2,2,1,23,0,1,0,2,20,140,176,1,17,91,0,0,8,2,31]
["2022-01-30","Legislativas","União das Freguesias de Algés, Linda-a-Velha e Cruz Quebrada-Dafundo","Escola Secundária Professor José Augusto Lucas","UFALCQD_41",824,554,538,9,7,270,5,36,11,174,1112,1,41,20,0,1,1,33,2,0,0,1,25,150,175,0,21,69,1,0,8,0,31]
["2022-01-30","Legislativas","União das Freguesias de Algés, Linda-a-Velha e Cruz Quebrada-Dafundo","Escola Secundária Professor José Augusto Lucas","UFALCQD_42",828,512,503,5,4,316,5,36,11,174,1113,1,42,16,0,1,1,23,0,1,0,0,32,129,179,0,10,60,2,0,8,0,41]
["2022-01-30","Legislativas","União das Freguesias de Algés, Linda-a-Velha e Cruz Quebrada-Dafundo","Escola Secundária Professor José Augusto Lucas","UFALCQD_34",805,521,518,2,1,284,5,36,11,174,1105,1,34,10,0,1,3,17,0,1,0,1,23,152,254,1,1,25,0,0,17,0,12]
["2022-01-30","Legislativas","União das Freguesias de Algés, Linda-a-Velha e Cruz Quebrada-Dafundo","Escola Secundária Professor José Augusto Lucas","UFALCQD_35",805,509,505,3,1,296,5,36,11,174,1106,1,35,5,1,2,0,22,0,0,0,2,18,135,264,0,7,20,0,0,7,0,22]
["2022-01-30","Legislativas","União das Freguesias de Algés, Linda-a-Velha e Cruz Quebrada-Dafundo","Escola Secundária Professor José Augusto Lucas","UFALCQD_36",817,545,539,3,3,272,5,36,11,174,1107,1,36,12,0,3,0,25,0,0,0,0,30,172,242,0,8,27,0,1,8,0,11]
["2022-01-30","Legislativas","União das Freguesias de Algés, Linda-a-Velha e Cruz Quebrada-Dafundo","Escola Secundária Professor José Augusto Lucas","UFALCQD_37",812,552,547,3,2,260,5,36,11,174,1108,1,37,11,0,0,0,25,0,0,1,2,20,160,245,0,11,46,0,1,8,0,17]
["2022-01-30","Legislativas","União das Freguesias de Algés, Linda-a-Velha e Cruz Quebrada-Dafundo","Escola Secundária Professor José Augusto Lucas","UFALCQD_38",812,547,533,9,5,265,5,36,11,174,1109,1,38,15,0,0,0,24,0,1,0,2,26,152,164,0,17,86,0,0,9,0,37]
["2022-01-30","Legislativas","União das Freguesias de Algés, Linda-a-Velha e Cruz Quebrada-Dafundo","Escola Secundária Professor José Augusto Lucas","UFALCQD_39",808,557,545,5,7,251,5,36,11,174,1110,1,39,21,2,0,2,27,0,0,1,1,34,181,172,0,9,54,0,1,4,1,35]
["2022-01-30","Legislativas","União das Freguesias de Algés, Linda-a-Velha e Cruz Quebrada-Dafundo","Escola Secundária Professor José Augusto Lucas","UFALCQD_28",802,556,549,4,3,246,5,36,11,174,1099,1,28,16,0,1,1,25,0,0,0,2,22,178,182,0,7,72,0,1,10,1,31]
["2022-01-30","Legislativas","União das Freguesias de Algés, Linda-a-Velha e Cruz Quebrada-Dafundo","Escola Secundária Professor José Augusto Lucas","UFALCQD_29",818,537,532,3,2,281,5,36,11,174,1100,1,29,22,0,0,0,35,1,0,0,3,29,140,196,0,14,54,0,0,7,0,31]
["2022-01-30","Legislativas","União das Freguesias de Algés, Linda-a-Velha e Cruz Quebrada-Dafundo","Escola Secundária Professor José Augusto Lucas","UFALCQD_30",813,590,583,6,1,223,5,36,11,174,1101,1,30,22,1,1,1,34,0,0,1,1,28,161,191,0,12,78,0,1,9,1,41]
["2022-01-30","Legislativas","União das Freguesias de Algés, Linda-a-Velha e Cruz Quebrada-Dafundo","Escola Secundária Professor José Augusto Lucas","UFALCQD_31",810,563,554,3,6,247,5,36,11,174,1102,1,31,14,0,0,1,28,0,0,0,3,27,183,210,1,9,33,0,0,10,0,35]
["2022-01-30","Legislativas","União das Freguesias de Algés, Linda-a-Velha e Cruz Quebrada-Dafundo","Escola Secundária Professor José Augusto Lucas","UFALCQD_32",808,487,480,6,1,321,5,36,11,174,1103,1,32,10,2,1,0,22,0,0,0,0,24,147,186,1,10,35,0,1,4,1,36]
["2022-01-30","Legislativas","União das Freguesias de Algés, Linda-a-Velha e Cruz Quebrada-Dafundo","Escola Secundária Professor José Augusto Lucas","UFALCQD_33",808,531,519,7,5,277,5,36,11,174,1104,1,33,13,0,1,1,24,0,0,0,0,39,152,181,0,12,50,0,0,7,2,37]
["2022-01-30","Legislativas","União das Freguesias de Algés, Linda-a-Velha e Cruz Quebrada-Dafundo","Instituto Espanhol","UFALCQD_43",751,465,456,6,3,286,5,36,11,175,1114,1,43,21,0,2,1,23,1,0,1,1,25,105,192,0,15,31,0,1,7,1,29]
["2022-01-30","Legislativas","União das Freguesias de Algés, Linda-a-Velha e Cruz Quebrada-Dafundo","Instituto Espanhol","UFALCQD_44",749,494,490,3,1,255,5,36,11,175,1115,1,44,13,1,1,2,30,0,0,0,1,30,129,179,0,4,57,0,2,13,0,28]
["2022-01-30","Legislativas","União das Freguesias de Algés, Linda-a-Velha e Cruz Quebrada-Dafundo","Instituto Espanhol","UFALCQD_45",756,491,484,3,4,265,5,36,11,175,1116,1,45,13,1,2,1,22,0,0,1,2,19,120,236,0,4,32,0,0,9,0,22]
["2022-01-30","Legislativas","União das Freguesias de Algés, Linda-a-Velha e Cruz Quebrada-Dafundo","Instituto Espanhol","UFALCQD_46",763,493,489,3,1,270,5,36,11,175,1117,1,46,22,1,1,2,28,1,1,0,5,23,118,162,0,15,73,1,1,8,0,27]
["2022-01-30","Legislativas","União das Freguesias de Algés, Linda-a-Velha e Cruz Quebrada-Dafundo","JI Roberto  Ivens","UFALCQD_47",671,467,460,4,3,204,5,36,11,176,1118,1,47,19,0,1,2,23,0,0,0,4,25,119,165,1,15,59,0,0,6,0,21]
["2022-01-30","Legislativas","União das Freguesias de Algés, Linda-a-Velha e Cruz Quebrada-Dafundo","JI Roberto  Ivens","UFALCQD_48",665,427,424,1,2,238,5,36,11,176,1119,1,48,15,2,1,0,12,0,0,0,0,22,118,171,0,5,54,0,1,7,0,16]
["2022-01-30","Legislativas","União das Freguesias de Algés, Linda-a-Velha e Cruz Quebrada-Dafundo","JI Roberto  Ivens","UFALCQD_49",670,457,455,1,1,213,5,36,11,176,1120,1,49,18,0,0,1,16,0,0,0,0,19,131,159,0,10,64,0,1,10,2,24]
["2022-01-30","Legislativas","União das Freguesias de Carnaxide e Queijas","EB 2/3 Vieira da Silva","UFCQ_01",872,623,609,11,3,249,5,36,12,178,1121,1,1,15,0,1,1,21,0,0,1,4,29,183,244,0,20,59,0,0,5,0,26]
["2022-01-30","Legislativas","União das Freguesias de Carnaxide e Queijas","EB 2/3 Vieira da Silva","UFCQ_02",882,648,636,11,1,234,5,36,12,178,1122,1,2,20,1,2,0,35,0,1,0,2,30,186,239,0,17,65,0,1,10,1,26]
["2022-01-30","Legislativas","União das Freguesias de Carnaxide e Queijas","EB 2/3 Vieira da Silva","UFCQ_03",876,605,589,13,3,271,5,36,12,178,1123,1,3,21,0,0,1,24,0,0,0,2,24,170,218,0,15,70,0,2,8,1,33]
["2022-01-30","Legislativas","União das Freguesias de Carnaxide e Queijas","EB 2/3 Vieira da Silva","UFCQ_04",883,581,567,7,7,302,5,36,12,178,1124,1,4,32,0,2,0,29,1,0,1,1,13,169,187,1,21,61,0,1,12,1,35]
["2022-01-30","Legislativas","União das Freguesias de Carnaxide e Queijas","EB 2/3 Vieira da Silva","UFCQ_05",878,596,592,2,2,282,5,36,12,178,1125,1,5,21,0,2,1,20,0,0,0,0,39,180,220,0,4,67,0,1,10,0,27]
["2022-01-30","Legislativas","União das Freguesias de Carnaxide e Queijas","EB 2/3 Vieira da Silva","UFCQ_06",879,594,586,5,3,285,5,36,12,178,1126,1,6,24,2,1,2,35,0,1,0,0,25,164,212,0,15,68,0,0,12,1,24]
["2022-01-30","Legislativas","União das Freguesias de Carnaxide e Queijas","EB 2/3 Vieira da Silva","UFCQ_13",867,615,603,9,3,252,5,36,12,178,1133,1,13,11,1,2,1,28,1,1,0,3,34,167,187,0,15,95,0,2,11,1,43]
["2022-01-30","Legislativas","União das Freguesias de Carnaxide e Queijas","EB 2/3 Vieira da Silva","UFCQ_14",881,633,620,9,4,248,5,36,12,178,1134,1,14,24,1,0,0,33,1,0,0,4,23,177,183,1,21,85,1,1,12,1,52]
["2022-01-30","Legislativas","União das Freguesias de Carnaxide e Queijas","EB 2/3 Vieira da Silva","UFCQ_15",873,621,614,3,4,252,5,36,12,178,1135,1,15,19,1,3,4,28,0,0,0,6,32,162,232,0,13,75,0,1,7,3,28]
["2022-01-30","Legislativas","União das Freguesias de Carnaxide e Queijas","EB 2/3 Vieira da Silva","UFCQ_07",882,658,641,13,4,224,5,36,12,178,1127,1,7,27,0,1,1,29,1,1,1,2,31,186,214,0,12,79,0,1,14,1,40]
["2022-01-30","Legislativas","União das Freguesias de Carnaxide e Queijas","EB 2/3 Vieira da Silva","UFCQ_08",879,625,614,7,4,254,5,36,12,178,1128,1,8,15,0,1,2,17,0,0,0,0,36,176,244,0,12,57,0,1,15,0,38]
["2022-01-30","Legislativas","União das Freguesias de Carnaxide e Queijas","EB 2/3 Vieira da Silva","UFCQ_09",886,631,616,10,5,255,5,36,12,178,1129,1,9,13,0,1,1,22,0,0,0,3,28,181,241,0,15,70,0,2,9,0,30]
["2022-01-30","Legislativas","União das Freguesias de Carnaxide e Queijas","EB 2/3 Vieira da Silva","UFCQ_10",870,619,612,4,3,251,5,36,12,178,1130,1,10,9,0,2,0,18,0,0,1,1,29,226,267,0,2,23,0,0,14,0,20]
["2022-01-30","Legislativas","União das Freguesias de Carnaxide e Queijas","EB 2/3 Vieira da Silva","UFCQ_11",883,630,620,4,6,253,5,36,12,178,1131,1,11,12,0,2,1,21,0,0,0,3,32,193,284,0,8,28,0,0,15,1,20]
["2022-01-30","Legislativas","União das Freguesias de Carnaxide e Queijas","EB 2/3 Vieira da Silva","UFCQ_12",877,607,603,3,1,270,5,36,12,178,1132,1,12,17,1,1,0,21,0,2,0,4,29,170,217,0,9,88,0,1,13,0,30]
["2022-01-30","Legislativas","União das Freguesias de Carnaxide e Queijas","EB 2,3 Sophia de Mello Breyner","UFCQ_16",857,538,519,8,11,319,5,36,12,179,1136,1,16,18,2,0,5,18,0,0,1,1,12,134,239,0,14,45,1,1,6,1,21]
["2022-01-30","Legislativas","União das Freguesias de Carnaxide e Queijas","EB 2,3 Sophia de Mello Breyner","UFCQ_17",860,490,475,8,7,370,5,36,12,179,1137,1,17,9,0,3,2,22,1,1,1,2,19,98,232,1,10,41,0,0,3,1,29]
["2022-01-30","Legislativas","União das Freguesias de Carnaxide e Queijas","EB 2,3 Sophia de Mello Breyner","UFCQ_18",853,433,420,5,8,420,5,36,12,179,1138,1,18,8,3,2,0,15,0,0,1,3,14,93,200,1,11,41,0,0,6,0,22]
["2022-01-30","Legislativas","União das Freguesias de Carnaxide e Queijas","EB 2,3 Sophia de Mello Breyner","UFCQ_19",857,450,437,1,12,407,5,36,12,179,1139,1,19,8,3,1,1,17,0,0,1,0,20,74,234,3,12,37,0,1,3,0,22]
["2022-01-30","Legislativas","União das Freguesias de Carnaxide e Queijas","EB 2,3 Sophia de Mello Breyner","UFCQ_20",857,510,502,7,1,347,5,36,12,179,1140,1,20,14,1,1,1,20,1,0,1,1,24,119,222,1,11,46,0,0,4,1,34]
["2022-01-30","Legislativas","União das Freguesias de Carnaxide e Queijas","EB 2,3 Sophia de Mello Breyner","UFCQ_21",867,477,466,8,3,390,5,36,12,179,1141,1,21,19,0,2,3,15,3,0,0,0,18,91,223,0,12,31,0,0,5,0,44]
["2022-01-30","Legislativas","União das Freguesias de Carnaxide e Queijas","EB 2,3 Sophia de Mello Breyner","UFCQ_22",853,499,492,5,2,354,5,36,12,179,1142,1,22,9,1,4,0,12,0,0,0,0,14,103,290,0,6,23,1,0,5,0,24]
["2022-01-30","Legislativas","União das Freguesias de Carnaxide e Queijas","EB 2,3 Sophia de Mello Breyner","UFCQ_23",854,458,445,9,4,396,5,36,12,179,1143,1,23,13,0,0,3,21,0,0,1,1,24,96,195,0,8,43,0,1,6,1,32]
["2022-01-30","Legislativas","União das Freguesias de Carnaxide e Queijas","EB 2,3 Sophia de Mello Breyner","UFCQ_24",860,516,505,5,6,344,5,36,12,179,1144,1,24,12,0,1,2,27,0,1,1,0,16,136,186,2,11,63,0,0,7,0,40]
["2022-01-30","Legislativas","União das Freguesias de Carnaxide e Queijas","EB 2,3 Sophia de Mello Breyner","UFCQ_25",848,467,455,7,5,381,5,36,12,179,1145,1,25,11,0,1,1,29,0,0,0,1,16,101,200,1,9,45,0,1,6,0,33]
["2022-01-30","Legislativas","União das Freguesias de Carnaxide e Queijas","EB 2/3 Professor Noronha Feio","UFCQ_26",761,585,574,9,2,176,5,36,12,180,1146,1,26,17,1,3,1,31,0,0,3,30,145,232,0,16,55,1,0,11,0,28,0]
["2022-01-30","Legislativas","União das Freguesias de Carnaxide e Queijas","EB 2/3 Professor Noronha Feio","UFCQ_27",760,556,548,2,6,204,5,36,12,180,1147,1,27,11,0,1,0,31,0,0,1,2,35,172,199,0,9,34,1,1,6,1,44]
["2022-01-30","Legislativas","União das Freguesias de Carnaxide e Queijas","EB 2/3 Professor Noronha Feio","UFCQ_28",753,480,475,4,1,273,5,36,12,180,1148,1,28,13,0,3,0,24,0,0,0,2,16,113,200,0,18,53,0,4,5,0,24]
["2022-01-30","Legislativas","União das Freguesias de Carnaxide e Queijas","EB 2/3 Professor Noronha Feio","UFCQ_29",764,560,546,11,3,204,5,36,12,180,1149,1,29,10,0,1,1,15,0,0,0,2,35,142,228,1,12,71,0,0,8,0,20]
["2022-01-30","Legislativas","União das Freguesias de Carnaxide e Queijas","EB 2/3 Professor Noronha Feio","UFCQ_30",758,527,519,6,2,231,5,36,12,180,1150,1,30,12,0,2,2,27,0,0,0,3,23,134,198,0,10,63,1,1,4,0,39]
["2022-01-30","Legislativas","União das Freguesias de Carnaxide e Queijas","EB 2/3 Professor Noronha Feio","UFCQ_31",764,557,551,5,1,207,5,36,12,180,1151,1,31,19,1,1,0,21,2,0,1,1,36,148,234,1,11,30,1,1,5,0,38]
["2022-01-30","Legislativas","União das Freguesias de Carnaxide e Queijas","EB 2/3 Professor Noronha Feio","UFCQ_32",755,551,549,2,0,204,5,36,12,180,1152,1,32,4,0,1,0,21,0,1,0,1,20,171,283,1,8,18,0,0,5,0,15]
["2022-01-30","Legislativas","União das Freguesias de Carnaxide e Queijas","EB 2/3 Professor Noronha Feio","UFCQ_33",759,533,524,3,6,226,5,36,12,180,1153,1,33,18,0,1,1,28,1,0,0,3,22,145,215,1,12,45,0,0,6,0,26]
["2022-01-30","Legislativas","União das Freguesias de Carnaxide e Queijas","EB 2/3 Professor Noronha Feio","UFCQ_34",755,539,528,9,2,216,5,36,12,180,1154,1,34,16,2,3,2,17,0,0,0,2,14,170,181,1,10,58,0,2,9,1,40]
["2022-01-30","Legislativas","União das Freguesias de Carnaxide e Queijas","EB 2/3 Professor Noronha Feio","UFCQ_35",763,551,540,10,1,212,5,36,12,180,1155,1,35,15,1,1,0,29,0,0,1,3,21,158,182,0,15,74,0,1,4,1,34]
["2022-01-30","Legislativas","União das Freguesias de Carnaxide e Queijas","EB1 Cesário Verde","UFCQ_36",513,374,366,5,3,139,5,36,12,181,1156,1,36,13,0,0,0,17,1,0,0,1,19,125,108,1,6,49,0,1,7,0,18]
["2022-01-30","Legislativas","União das Freguesias de Carnaxide e Queijas","EB1 Cesário Verde","UFCQ_37",513,406,401,3,2,107,5,36,12,181,1157,1,37,13,2,1,1,21,0,0,0,2,15,131,131,0,5,51,0,0,7,0,21]
["2022-01-30","Legislativas","União das Freguesias de Oeiras e São Julião da Barra, Paço de Arcos e Caxias","EB1 Conde Ferreira","UFOPAC_01",918,607,597,7,3,311,5,36,13,182,1158,1,1,15,0,1,1,30,0,0,0,1,26,196,214,0,18,59,0,1,9,0,26]
["2022-01-30","Legislativas","União das Freguesias de Oeiras e São Julião da Barra, Paço de Arcos e Caxias","EB1 Conde Ferreira","UFOPAC_02",914,578,569,6,3,336,5,36,13,182,1159,1,2,28,2,1,1,20,1,0,0,1,23,170,176,0,11,78,1,0,21,0,35]
["2022-01-30","Legislativas","União das Freguesias de Oeiras e São Julião da Barra, Paço de Arcos e Caxias","EB1 Conde Ferreira","UFOPAC_03",917,616,608,5,3,301,5,36,13,182,1160,1,3,27,1,1,2,26,0,0,1,2,17,199,194,0,11,66,0,2,12,0,47]
["2022-01-30","Legislativas","União das Freguesias de Oeiras e São Julião da Barra, Paço de Arcos e Caxias","EB1 Conde Ferreira","UFOPAC_04",923,590,585,2,3,333,5,36,13,182,1161,1,4,11,0,1,0,21,1,0,1,1,18,188,232,0,7,55,0,0,16,1,32]
["2022-01-30","Legislativas","União das Freguesias de Oeiras e São Julião da Barra, Paço de Arcos e Caxias","EB1 Conde Ferreira","UFOPAC_05",917,603,592,6,5,314,5,36,13,182,1162,1,5,17,1,2,0,26,0,1,0,1,15,173,227,0,12,54,0,0,25,0,38]
["2022-01-30","Legislativas","União das Freguesias de Oeiras e São Julião da Barra, Paço de Arcos e Caxias","EB1 Conde Ferreira","UFOPAC_06",922,626,615,7,4,296,5,36,13,182,1163,1,6,18,0,2,0,25,0,1,0,3,24,182,179,0,15,103,1,0,21,0,41]
["2022-01-30","Legislativas","União das Freguesias de Oeiras e São Julião da Barra, Paço de Arcos e Caxias","EB 2,3 Conde de Oeiras","UFOPAC_07",742,516,506,4,6,226,5,36,13,183,1164,1,7,22,1,1,0,22,0,0,1,1,18,155,190,0,14,49,0,0,15,0,17]
["2022-01-30","Legislativas","União das Freguesias de Oeiras e São Julião da Barra, Paço de Arcos e Caxias","EB 2,3 Conde de Oeiras","UFOPAC_08",737,500,495,3,2,237,5,36,13,183,1165,1,8,15,0,0,0,23,0,0,0,0,18,165,168,1,10,42,0,2,11,0,40]
["2022-01-30","Legislativas","União das Freguesias de Oeiras e São Julião da Barra, Paço de Arcos e Caxias","EB 2,3 Conde de Oeiras","UFOPAC_09",744,489,481,7,1,255,5,36,13,183,1166,1,9,25,0,1,2,20,0,1,0,2,14,149,169,0,7,44,0,1,19,1,26]
["2022-01-30","Legislativas","União das Freguesias de Oeiras e São Julião da Barra, Paço de Arcos e Caxias","EB 2,3 Conde de Oeiras","UFOPAC_10",742,494,485,3,6,248,5,36,13,183,1167,1,10,33,0,2,1,25,0,1,0,0,16,145,147,0,15,58,0,0,12,0,30]
["2022-01-30","Legislativas","União das Freguesias de Oeiras e São Julião da Barra, Paço de Arcos e Caxias","EB 2,3 Conde de Oeiras","UFOPAC_11",744,510,503,6,1,234,5,36,13,183,1168,1,11,23,0,1,1,18,0,0,0,4,27,159,154,0,6,57,0,1,5,0,47]
["2022-01-30","Legislativas","União das Freguesias de Oeiras e São Julião da Barra, Paço de Arcos e Caxias","EB 2,3 Conde de Oeiras","UFOPAC_12",736,507,503,1,3,229,5,36,13,183,1169,1,12,11,0,0,1,33,2,0,0,1,16,172,171,0,7,44,0,1,21,0,23]
["2022-01-30","Legislativas","União das Freguesias de Oeiras e São Julião da Barra, Paço de Arcos e Caxias","EB 2,3 Conde de Oeiras","UFOPAC_13",739,516,509,4,3,223,5,36,13,183,1170,1,13,12,1,1,1,20,0,1,0,0,21,173,196,0,11,36,0,0,17,0,19]
["2022-01-30","Legislativas","União das Freguesias de Oeiras e São Julião da Barra, Paço de Arcos e Caxias","EB 2,3 Conde de Oeiras","UFOPAC_14",748,543,539,3,1,205,5,36,13,183,1171,1,14,23,0,1,2,30,0,0,1,0,22,159,194,1,11,50,0,0,14,0,31]
["2022-01-30","Legislativas","União das Freguesias de Oeiras e São Julião da Barra, Paço de Arcos e Caxias","EB 2,3 Conde de Oeiras","UFOPAC_15",748,506,494,6,6,242,5,36,13,183,1172,1,15,24,1,0,1,21,0,0,0,2,22,140,153,0,10,72,0,0,10,1,37]
["2022-01-30","Legislativas","União das Freguesias de Oeiras e São Julião da Barra, Paço de Arcos e Caxias","EB 2,3 Conde de Oeiras","UFOPAC_16",758,523,515,7,1,235,5,36,13,183,1173,1,16,21,1,1,1,22,2,0,0,4,20,132,193,2,19,51,0,0,11,1,34]
["2022-01-30","Legislativas","União das Freguesias de Oeiras e São Julião da Barra, Paço de Arcos e Caxias","EB1 Gomes Freire de Andrade","UFOPAC_17",787,552,545,6,1,235,5,36,13,184,1174,1,17,10,1,1,0,24,0,0,0,2,33,152,219,0,10,54,0,0,14,0,25]
["2022-01-30","Legislativas","União das Freguesias de Oeiras e São Julião da Barra, Paço de Arcos e Caxias","EB1 Gomes Freire de Andrade","UFOPAC_18",793,568,559,7,2,225,5,36,13,184,1175,1,18,19,1,2,0,36,0,0,0,2,16,127,251,2,16,51,0,0,8,0,28]
["2022-01-30","Legislativas","União das Freguesias de Oeiras e São Julião da Barra, Paço de Arcos e Caxias","EB1 Gomes Freire de Andrade","UFOPAC_19",787,515,506,6,3,272,5,36,13,184,1176,1,19,21,0,1,0,25,2,0,1,1,16,147,184,0,16,47,0,1,5,1,38]
["2022-01-30","Legislativas","União das Freguesias de Oeiras e São Julião da Barra, Paço de Arcos e Caxias","EB1 Gomes Freire de Andrade","UFOPAC_20",792,510,505,5,0,282,5,36,13,184,1177,1,20,13,1,1,1,39,0,0,0,0,18,132,180,0,10,64,0,1,11,1,33]
["2022-01-30","Legislativas","União das Freguesias de Oeiras e São Julião da Barra, Paço de Arcos e Caxias","EB1 Gomes Freire de Andrade","UFOPAC_21",793,458,450,3,5,335,5,36,13,184,1178,1,21,13,0,1,0,27,0,0,0,1,21,150,167,1,4,39,0,0,3,1,22]
["2022-01-30","Legislativas","União das Freguesias de Oeiras e São Julião da Barra, Paço de Arcos e Caxias","EB1 Gomes Freire de Andrade","UFOPAC_22",790,513,506,5,2,277,5,36,13,184,1179,1,22,21,0,0,1,28,0,0,1,3,15,139,169,0,12,66,0,2,11,1,37]
["2022-01-30","Legislativas","União das Freguesias de Oeiras e São Julião da Barra, Paço de Arcos e Caxias","EB1 Gomes Freire de Andrade","UFOPAC_29",792,535,532,2,1,257,5,36,13,184,1186,1,29,16,0,2,1,27,1,0,0,1,19,180,190,0,12,39,0,0,13,1,30]
["2022-01-30","Legislativas","União das Freguesias de Oeiras e São Julião da Barra, Paço de Arcos e Caxias","EB1 Gomes Freire de Andrade","UFOPAC_30",789,503,494,5,4,286,5,36,13,184,1187,1,30,15,2,2,2,32,1,0,1,2,19,126,178,0,10,67,0,1,9,1,26]
["2022-01-30","Legislativas","União das Freguesias de Oeiras e São Julião da Barra, Paço de Arcos e Caxias","EB1 Gomes Freire de Andrade","UFOPAC_31",788,527,517,6,4,261,5,36,13,184,1188,1,31,22,1,1,1,24,0,1,0,2,21,148,143,0,17,80,0,0,6,2,48]
["2022-01-30","Legislativas","União das Freguesias de Oeiras e São Julião da Barra, Paço de Arcos e Caxias","EB1 Gomes Freire de Andrade","UFOPAC_32",793,490,481,6,3,303,5,36,13,184,1189,1,32,23,0,3,2,35,0,0,1,1,20,129,163,0,16,54,0,1,9,3,21]
["2022-01-30","Legislativas","União das Freguesias de Oeiras e São Julião da Barra, Paço de Arcos e Caxias","EB1 Gomes Freire de Andrade","UFOPAC_33",797,484,477,4,3,313,5,36,13,184,1190,1,33,13,0,2,0,25,0,0,0,5,16,130,176,0,18,53,0,0,15,0,24]
["2022-01-30","Legislativas","União das Freguesias de Oeiras e São Julião da Barra, Paço de Arcos e Caxias","EB1 Gomes Freire de Andrade","UFOPAC_23",798,548,537,8,3,250,5,36,13,184,1180,1,23,22,1,0,2,30,1,1,1,2,20,166,180,2,19,56,0,0,8,0,26]
["2022-01-30","Legislativas","União das Freguesias de Oeiras e São Julião da Barra, Paço de Arcos e Caxias","EB1 Gomes Freire de Andrade","UFOPAC_24",792,531,520,8,3,261,5,36,13,184,1181,1,24,16,0,2,0,23,0,0,0,1,18,172,180,1,4,54,0,0,9,0,40]
["2022-01-30","Legislativas","União das Freguesias de Oeiras e São Julião da Barra, Paço de Arcos e Caxias","EB1 Gomes Freire de Andrade","UFOPAC_25",790,512,505,2,5,278,5,36,13,184,1182,1,25,16,0,1,1,23,0,1,0,2,20,145,203,0,14,42,0,0,10,0,27]
["2022-01-30","Legislativas","União das Freguesias de Oeiras e São Julião da Barra, Paço de Arcos e Caxias","EB1 Gomes Freire de Andrade","UFOPAC_26",794,532,527,1,4,262,5,36,13,184,1183,1,26,22,1,0,0,30,2,0,0,2,16,136,220,0,17,50,0,1,10,1,19]
["2022-01-30","Legislativas","União das Freguesias de Oeiras e São Julião da Barra, Paço de Arcos e Caxias","EB1 Gomes Freire de Andrade","UFOPAC_27",792,518,518,0,0,274,5,36,13,184,1184,1,27,7,1,2,0,20,0,0,0,2,13,154,267,0,10,16,0,0,10,0,16]
["2022-01-30","Legislativas","União das Freguesias de Oeiras e São Julião da Barra, Paço de Arcos e Caxias","EB1 Gomes Freire de Andrade","UFOPAC_28",786,534,527,2,5,252,5,36,13,184,1185,1,28,6,0,5,0,18,0,0,0,3,22,175,235,0,4,21,0,0,14,0,24]
["2022-01-30","Legislativas","União das Freguesias de Oeiras e São Julião da Barra, Paço de Arcos e Caxias","EB 2,3 S. Julião da Barra","UFOPAC_34",680,470,459,7,4,210,5,36,13,185,1191,1,34,16,0,1,3,16,0,0,0,7,25,146,126,0,9,62,2,1,15,2,28]
["2022-01-30","Legislativas","União das Freguesias de Oeiras e São Julião da Barra, Paço de Arcos e Caxias","EB 2,3 S. Julião da Barra","UFOPAC_35",682,471,467,2,2,211,5,36,13,185,1192,1,35,18,0,0,1,13,1,0,0,2,22,146,147,0,12,59,0,1,16,1,28]
["2022-01-30","Legislativas","União das Freguesias de Oeiras e São Julião da Barra, Paço de Arcos e Caxias","EB 2,3 S. Julião da Barra","UFOPAC_36",675,460,449,6,5,215,5,36,13,185,1193,1,36,10,0,0,0,20,2,0,0,1,29,150,138,0,8,54,0,0,11,1,25]
["2022-01-30","Legislativas","União das Freguesias de Oeiras e São Julião da Barra, Paço de Arcos e Caxias","EB 2,3 S. Julião da Barra","UFOPAC_37",680,464,457,3,4,216,5,36,13,185,1194,1,37,15,1,2,1,19,0,0,1,1,22,143,161,0,8,46,0,1,16,0,20]
["2022-01-30","Legislativas","União das Freguesias de Oeiras e São Julião da Barra, Paço de Arcos e Caxias","EB 2,3 S. Julião da Barra","UFOPAC_38",687,480,467,9,4,207,5,36,13,185,1195,1,38,21,1,2,0,26,0,0,0,3,15,127,157,0,14,65,0,1,11,0,24]
["2022-01-30","Legislativas","União das Freguesias de Oeiras e São Julião da Barra, Paço de Arcos e Caxias","Escola Náutica Infante D. Henrique","UFOPAC_39",787,520,513,6,1,267,5,36,13,186,1196,1,39,26,0,4,1,25,0,0,1,3,22,141,176,0,13,70,1,1,11,1,17]
["2022-01-30","Legislativas","União das Freguesias de Oeiras e São Julião da Barra, Paço de Arcos e Caxias","Escola Náutica Infante D. Henrique","UFOPAC_40",787,538,528,5,5,249,5,36,13,186,1197,1,40,21,0,1,2,22,0,1,0,3,30,160,201,0,6,41,0,2,7,0,31]
["2022-01-30","Legislativas","União das Freguesias de Oeiras e São Julião da Barra, Paço de Arcos e Caxias","Escola Náutica Infante D. Henrique","UFOPAC_41",783,514,504,7,3,269,5,36,13,186,1198,1,41,17,0,1,1,22,0,0,0,4,18,151,176,0,11,55,0,0,12,0,36]
["2022-01-30","Legislativas","União das Freguesias de Oeiras e São Julião da Barra, Paço de Arcos e Caxias","Escola Náutica Infante D. Henrique","UFOPAC_42",817,472,462,5,5,345,5,36,13,186,1199,1,42,7,1,2,1,30,0,1,0,1,24,104,208,0,14,28,0,1,5,1,34]
["2022-01-30","Legislativas","União das Freguesias de Oeiras e São Julião da Barra, Paço de Arcos e Caxias","Escola Náutica Infante D. Henrique","UFOPAC_43",813,498,490,3,5,315,5,36,13,186,1200,1,43,12,0,1,0,30,1,0,0,2,27,121,218,0,7,21,0,0,15,0,35]
["2022-01-30","Legislativas","União das Freguesias de Oeiras e São Julião da Barra, Paço de Arcos e Caxias","Escola Náutica Infante D. Henrique","UFOPAC_44",819,473,466,5,2,346,5,36,13,186,1201,1,44,9,1,1,0,35,1,0,3,0,23,108,195,1,16,32,0,1,7,0,33]
["2022-01-30","Legislativas","União das Freguesias de Oeiras e São Julião da Barra, Paço de Arcos e Caxias","EB 2,3 Dr. Joaquim de Barros","UFOPAC_45",836,581,565,11,5,255,5,36,13,187,1202,1,45,21,0,1,2,31,0,0,0,3,29,198,161,0,11,64,0,2,12,0,30]
["2022-01-30","Legislativas","União das Freguesias de Oeiras e São Julião da Barra, Paço de Arcos e Caxias","EB 2,3 Dr. Joaquim de Barros","UFOPAC_46",839,570,561,5,4,269,5,36,13,187,1203,1,46,23,0,0,0,30,1,0,1,1,36,169,195,0,7,58,0,0,15,0,25]
["2022-01-30","Legislativas","União das Freguesias de Oeiras e São Julião da Barra, Paço de Arcos e Caxias","EB 2,3 Dr. Joaquim de Barros","UFOPAC_47",830,555,547,7,1,275,5,36,13,187,1204,1,47,29,0,0,1,21,0,0,0,1,20,162,188,0,13,65,0,0,19,0,28]
["2022-01-30","Legislativas","União das Freguesias de Oeiras e São Julião da Barra, Paço de Arcos e Caxias","EB JI/1 Maria Luciana Seruca","UFOPAC_48",728,506,496,7,3,222,5,36,13,188,1205,1,48,19,1,0,1,28,1,0,0,1,15,145,178,0,16,49,0,1,10,0,31]
["2022-01-30","Legislativas","União das Freguesias de Oeiras e São Julião da Barra, Paço de Arcos e Caxias","EB JI/1 Maria Luciana Seruca","UFOPAC_49",724,473,462,10,1,251,5,36,13,188,1206,1,49,16,1,2,3,30,0,0,1,1,15,123,146,0,14,65,0,1,10,1,33]
["2022-01-30","Legislativas","União das Freguesias de Oeiras e São Julião da Barra, Paço de Arcos e Caxias","EB JI/1 Maria Luciana Seruca","UFOPAC_50",722,449,435,6,8,273,5,36,13,188,1207,1,50,18,1,1,1,18,0,0,1,1,19,117,146,0,5,60,0,1,12,0,34]
["2022-01-30","Legislativas","União das Freguesias de Oeiras e São Julião da Barra, Paço de Arcos e Caxias","EB JI/1 Maria Luciana Seruca","UFOPAC_51",726,505,495,5,5,221,5,36,13,188,1208,1,51,13,0,0,1,33,0,0,0,1,19,135,164,0,14,68,0,0,15,0,32]
["2022-01-30","Legislativas","União das Freguesias de Oeiras e São Julião da Barra, Paço de Arcos e Caxias","EB JI/1 Maria Luciana Seruca","UFOPAC_52",726,509,499,8,2,217,5,36,13,188,1209,1,52,12,1,2,1,35,0,0,0,0,15,157,177,0,7,41,1,0,7,1,42]
["2022-01-30","Legislativas","União das Freguesias de Oeiras e São Julião da Barra, Paço de Arcos e Caxias","EB JI/1 Maria Luciana Seruca","UFOPAC_53",722,501,493,6,2,221,5,36,13,188,1210,1,53,13,2,1,4,21,0,0,0,2,16,147,192,0,14,39,0,0,14,1,27]
["2022-01-30","Legislativas","União das Freguesias de Oeiras e São Julião da Barra, Paço de Arcos e Caxias","EB JI/1 Maria Luciana Seruca","UFOPAC_54",725,470,457,7,6,255,5,36,13,188,1211,1,54,14,1,3,0,22,1,0,0,1,13,130,151,0,14,69,0,0,7,0,31]
["2022-01-30","Legislativas","União das Freguesias de Oeiras e São Julião da Barra, Paço de Arcos e Caxias","EB JI/1 Maria Luciana Seruca","UFOPAC_55",726,495,487,5,3,231,5,36,13,188,1212,1,55,15,0,2,3,26,0,0,0,2,20,148,149,0,14,67,0,0,10,1,30]
["2022-01-30","Legislativas","União das Freguesias de Oeiras e São Julião da Barra, Paço de Arcos e Caxias","EB1 São Bruno","UFOPAC_56",728,494,489,4,1,234,5,36,13,189,1213,1,56,11,1,1,1,28,1,0,1,2,12,133,207,0,13,51,0,0,9,0,18]
["2022-01-30","Legislativas","União das Freguesias de Oeiras e São Julião da Barra, Paço de Arcos e Caxias","EB1 São Bruno","UFOPAC_57",727,480,477,3,0,247,5,36,13,189,1214,1,57,15,0,5,1,19,0,0,0,0,25,122,186,0,10,53,1,0,9,0,31]
["2022-01-30","Legislativas","União das Freguesias de Oeiras e São Julião da Barra, Paço de Arcos e Caxias","EB1 São Bruno","UFOPAC_58",731,453,443,5,5,278,5,36,13,189,1215,1,58,13,2,0,1,18,0,1,0,1,8,113,191,0,18,46,0,1,7,0,23]
["2022-01-30","Legislativas","União das Freguesias de Oeiras e São Julião da Barra, Paço de Arcos e Caxias","EB1 São Bruno","UFOPAC_59",723,490,482,6,2,233,5,36,13,189,1216,1,59,15,1,1,3,15,0,0,1,0,18,139,159,0,15,54,0,1,18,1,41]
["2022-01-30","Legislativas","União das Freguesias de Oeiras e São Julião da Barra, Paço de Arcos e Caxias","EB1 São Bruno","UFOPAC_60",729,502,488,11,3,227,5,36,13,189,1217,1,60,10,0,1,0,24,1,1,0,1,24,133,166,1,9,72,0,2,7,1,35]
["2022-01-30","Legislativas","União das Freguesias de Oeiras e São Julião da Barra, Paço de Arcos e Caxias","EB1 São Bruno","UFOPAC_61",726,482,475,5,2,244,5,36,13,189,1218,1,61,10,0,3,1,23,0,0,2,4,20,128,174,0,13,55,0,1,15,2,24]
["2022-01-30","Legislativas","União das Freguesias de Oeiras e São Julião da Barra, Paço de Arcos e Caxias","EB1 São Bruno","UFOPAC_62",730,490,483,4,3,240,5,36,13,189,1219,1,62,8,0,2,0,19,0,0,2,0,14,143,218,0,11,24,0,2,19,0,21]
["2022-01-30","Legislativas","União das Freguesias de Oeiras e São Julião da Barra, Paço de Arcos e Caxias","EB1 São Bruno","UFOPAC_63",736,514,501,9,4,222,5,36,13,189,1220,1,63,20,1,4,1,27,0,0,1,1,23,148,166,0,8,53,0,0,24,1,23]
["2022-01-30","Legislativas","União das Freguesias de Oeiras e São Julião da Barra, Paço de Arcos e Caxias","EB1 São Bruno","UFOPAC_64",731,481,473,3,5,250,5,36,13,189,1221,1,64,14,0,0,1,30,0,1,0,5,11,149,144,1,13,65,1,1,8,1,28]
["2022-01-30","Legislativas","União das Freguesias de Oeiras e São Julião da Barra, Paço de Arcos e Caxias","EB1 São Bruno","UFOPAC_65",732,467,450,11,6,265,5,36,13,189,1222,1,65,17,0,1,0,21,1,0,0,1,14,111,163,0,14,65,0,1,8,1,32]

{"sheet":"Apuram","index":1,"n_rows":32,"n_cols":13,"rows_kept":32,"cut":false,"hidden":false,"merged":[[0,0,0,12],[1,0,1,12],[3,1,3,10],[3,11,4,12],[4,1,4,2],[4,3,4,4],[4,5,4,6],[4,7,4,8],[4,9,4,10],[31,11,31,12],[31,1,31,2],[31,3,31,4],[31,5,31,6],[31,7,31,8],[31,9,31,10]]}
["Apuramento Provisório no Concelho de Oeiras"]
["Eleições Legislativas - 30 de Janeiro de 2022"]
[]
[null,"FREGUESIAS",null,null,null,null,null,null,null,null,null,"TOTAIS"]
["c","ALGÉS, LAV, CQD",null,"CARNAXIDE, QUEIJAS",null,"OEIRAS, P.A., CAXIAS",null,"BARCARENA",null,"PORTO SALVO"]
["INSCRITOS",40835,0.27955774628602725,30352,0.20779078523995345,50209,0.34373245704114463,12083,8.2720613404532073E-2,12591,8.6198398028342574E-2,146070,"-"]
["VOTANTES",27686,0.67799681645647114,20343,0.67023589878755929,33381,0.66484096476727284,8349,0.69097078540097656,7884,0.62616154395997137,97643,0.66846717327308824]
["EXPRESSOS",27314,0.98656360615473526,19959,0.9811237280637074,32822,0.98325394685599588,8191,0.98107557791352262,7690,0.97539320142059871,95976,0.98292760361725884]
["BRANCOS",240,8.6686411904933897E-3,243,1.1945140834685149E-2,349,1.0455049279530271E-2,104,1.2456581626542101E-2,117,1.4840182648401826E-2,1053,1.0784183197976301E-2]
["NULOS",132,4.7677526547713648E-3,141,6.9311311016074326E-3,210,6.2910038644738023E-3,54,6.4678404599353215E-3,77,9.7666159309994921E-3,614,6.2882131847649091E-3]
["ABSTENÇÃO",13149,0.32200318354352886,10009,0.32976410121244071,16828,0.33515903523272722,3734,0.30902921459902344,4707,0.37383845604002858,48427,0.33153282672691176]
["L",947,3.4205013364155171E-2,562,2.7626210490094873E-2,1098,3.289296306282017E-2,184,2.2038567493112948E-2,176,2.2323693556570268E-2,2967,3.0386202799995904E-2]
["MPT",24,8.6686411904933903E-4,24,1.1797669960182864E-3,33,9.8858632156016897E-4,13,1.5570727033177626E-3,12,1.5220700152207001E-3,106,1.0855872924838443E-3]
["PCTP/MRPP",53,1.9143249295672903E-3,54,2.6544757410411446E-3,87,2.6062730295677182E-3,36,4.3118936399568807E-3,25,3.1709791983764585E-3,255,2.6115543356922668E-3]
["R.I.R.",46,1.6614895615112331E-3,41,2.0154352848645728E-3,61,1.8273868368233427E-3,23,2.7548209366391185E-3,25,3.1709791983764585E-3,196,2.0073123521399385E-3]
["B.E.",1253,4.5257530882034241E-2,859,4.2225827065821168E-2,1625,4.8680387046523471E-2,415,4.9706551682836268E-2,402,5.0989345509893452E-2,4554,4.6639288018598367E-2]
["NC",21,7.5850610416817164E-4,13,6.3904045617657178E-4,24,7.1897187022557747E-4,9,1.0779734099892202E-3,5,6.3419583967529169E-4,72,7.3738004772487531E-4]
["E",9,3.2507404464350212E-4,9,4.4241262350685741E-4,13,3.894430963721878E-4,6,7.1864893999281352E-4,5,6.3419583967529169E-4,42,4.301383611728439E-4]
["A",13,4.6955139781839196E-4,17,8.3566828884628621E-4,24,7.1897187022557747E-4,7,8.3842376332494907E-4,11,1.3952308472856417E-3,72,7.3738004772487531E-4]
["ADN",78,2.817308386910352E-3,96,4.7190679840731454E-3,111,3.3252448997932956E-3,17,2.0361719966463048E-3,28,3.5514967021816335E-3,330,3.3796585520723451E-3]
["PCP-PEV",1197,4.3234847937585787E-2,1012,4.974684166543774E-2,1283,3.8435037895808995E-2,415,4.9706551682836268E-2,315,3.9954337899543377E-2,4222,4.3239146687422549E-2]
["PPD/PSD",8287,0.299320956440078,5576,0.2740991987415819,9612,0.28794823402534375,2022,0.24218469277757815,1644,0.20852359208523591,27141,0.27796155382362281]
["PS",9514,0.34363938452647547,7769,0.38190040800275277,11786,0.35307510260327729,3316,0.39717331416936158,3566,0.45230847285641806,35951,0.36818819577440265]
["JPP",8,2.8895470634977968E-4,33,1.6221796195251437E-3,13,3.894430963721878E-4,4,4.7909929332854237E-4,9,1.1415525114155251E-3,67,6.8617309996620338E-4]
["PAN",544,1.9648920031785019E-2,474,2.3300398171361158E-2,764,2.288727120218088E-2,224,2.682956042639837E-2,192,2.4353120243531201E-2,2198,2.2510574234712165E-2]
["IL",3189,0.11518456981868092,1952,9.5954382342820624E-2,3487,0.10446062131152452,761,9.1148640555755181E-2,619,7.8513444951801112E-2,10008,0.10249582663375767]
["PTP",7,2.5283536805605723E-4,6,2.9494174900457159E-4,8,2.3965729007519246E-4,1,1.1977482333213559E-4,3,3.8051750380517502E-4,25,2.5603473879335948E-4]
["VP",21,7.5850610416817164E-4,40,1.9662783266971439E-3,38,1.1383721278571642E-3,7,8.3842376332494907E-4,7,8.8787417554540837E-4,113,1.1572770193459848E-3]
["CDS-PP",637,2.3008018493101207E-2,284,1.3960576119549721E-2,785,2.3516371588628262E-2,112,1.3414780213199185E-2,97,1.2303399289700659E-2,1915,1.9612260991571335E-2]
["MAS",28,1.0113414722242289E-3,46,2.2612200757017157E-3,33,9.8858632156016897E-4,12,1.437297879985627E-3,10,1.2683916793505834E-3,129,1.3211392521737348E-3]
["CH",1438,5.1939608466372897E-2,1092,5.3679398318832033E-2,1937,5.8027021359455977E-2,607,7.2703317762606301E-2,539,6.8366311516996445E-2,5613,5.7484919553885072E-2]
["SEC. DE VOTO",49,null,37,null,65,null,17,null,19,null,187]

{"sheet":"HONDT","index":2,"n_rows":188,"n_cols":42,"rows_kept":188,"cut":false,"hidden":true,"merged":[[3,37,3,41],[3,1,3,5],[3,7,3,11],[3,13,3,17],[3,19,3,23],[3,25,3,29],[3,31,3,35]]}
[]
[null,"Aplicação do método de Hondt - Divisões sucessivas para obtenção dos Mandatos"]
[null,"O cálculo dos mandatos é efectuado pela Macro \"Seleccionar_Ordenar_Crescente\""]
[null,"Câmara Municipal - 11 elementos",null,null,null,null,null,"Assembleia Municipal - 33 elementos",null,null,null,null,null,"Assembleia de Freguesia - Algés, LAV, CQD",null,null,null,null,null,"Assembleia de Freguesia - Barcarena",null,null,null,null,null,"Assembleia de Freguesia - Carnaxide, QUEIJAS",null,null,null,null,null,"Assembleia de Freguesia -\nOEIRAS, PA, CAXIAS",null,null,null,null,null,"Assembleia de Freguesia - PORTO SALVO"]
[]
[null,"Partidos","Votação",null,"Partidos","Ordenação",null,"Partidos","Votação",null,"Partidos","Ordenação",null,"Partidos","Votação",null,"Partidos","Ordenação",null,"Partidos","Votação",null,"Partidos","Ordenação",null,"Partidos","Votação",null,"Partidos","Ordenação",null,"Partidos","Votação",null,"Partidos","Ordenação",null,"Partidos","Votação",null,"Partidos","Ordenação"]
[null,"PS",{"$f":"Apuram!L12","v":2967},null,"BE",12,null,"CDU",{"$f":"#REF!","v":{"$error":"#REF!"}},null,"CDU",0,null,"IOMAF",854,null,"CDS/PP",3018,null,"IOMAF",1954,null,"IOMAF",1954,null,"IOMAF",3800,null,"IOMAF",3800,null,"IOMAF",916,null,"PPD/PSD",1534,null,"IOMAF",346,null,"PPD/PSD",1016]
[null,"PPD/PSD",{"$f":"Apuram!L13","v":106},null,"PCTP/MRPP",10,null,"BE",{"$f":"#REF!","v":{"$error":"#REF!"}},null,"BE",0,null,"CDS/PP",3018,null,"PPD/PSD",2611,null,"CDS/PP",746,null,"CDU",1730,null,"CDS/PP",2889,null,"CDS/PP",2889,null,"CDS/PP",164,null,"IOMAF",916,null,"CDS/PP",356,null,"PS",1000]
[null,"PTP",{"$f":"Apuram!L14","v":255},null,"IOMAF",8,null,"PAN",{"$f":"#REF!","v":{"$error":"#REF!"}},null,"PAN",0,null,"PS",455,null,"CDU",2422,null,"PS",795,null,"BE",977,null,"PS",477,null,"BE",1900,null,"PS",275,null,"CDU",837,null,"PS",1000,null,"IOMAF",508]
[null,"IOMAF",{"$f":"Apuram!L15","v":196},null,"PTP",6,null,"PPD/PSD",{"$f":"#REF!","v":{"$error":"#REF!"}},null,"PPD/PSD",0,null,"PPD/PSD",2611,null,"IOMAF",1509,null,"PPD/PSD",320,null,"PPD/PSD",865,null,"PPD/PSD",1657,null,"PPD/PSD",1657,null,"PPD/PSD",1534,null,"PTP",767,null,"PPD/PSD",1016,null,"PAN",500]
[null,"PCTP/MRPP",{"$f":"Apuram!L16","v":4554},null,"PTP",6,null,"IOMAF",{"$f":"#REF!","v":{"$error":"#REF!"}},null,"IOMAF",0,null,"CDU",2422,null,"PS",1305.5,null,"CDU",1730,null,"PS",795,null,"CDU",935,null,"IOMAF",1444.5,null,"CDU",837,null,"CDU",511.33333333333331,null,"CDU",123,null,"CDS/PP",356]
[null,"BE",{"$f":"Apuram!L17","v":72},null,"PPD/PSD",5,null,"CDS/PP",{"$f":"#REF!","v":{"$error":"#REF!"}},null,"CDS/PP",0,null,"BE",0,null,"PPD/PSD",1211,null,"BE",0,null,"CDS/PP",746,null,"BE",0,null,"CDU",1266.6666666666667,null,"BE",0,null,"BE",458,null,"BE",0,null,"IOMAF",346]
[null,"CDS/PP",{"$f":"Apuram!L18","v":42},null,"PPD/PSD",4,null,"PS",{"$f":"#REF!","v":{"$error":"#REF!"}},null,"PS",0,null,null,null,null,"BE",1006,null,null,null,null,"CDU",651.33333333333337,null,null,null,null,"BE",963,null,"MMS",null,null,"IOMAF",418.5,null,"MMS",null,null,"BE",338.66666666666669]
[null,"PAN",{"$f":"Apuram!L19","v":72},null,"PS",4,null,null,null,null,"CDU",0,null,null,null,null,"CDS/PP",870.33333333333337,null,null,null,null,"PS",576.66666666666663,null,null,null,null,"PPD/PSD",950,null,"PAN",null,null,"IOMAF",383.5,null,"PAN",null,null,"CDU",333.33333333333331]
[null,"CDU",{"$f":"Apuram!L20","v":330},null,"CDU",4,null,null,null,null,"BE",0,null,null,null,null,"IOMAF",854,null,null,null,null,"PPD/PSD",488.5,null,null,null,null,"CDU",935,null,"PTP",null,null,"BE",306.8,null,null,null,null,"PS",254]
[null,null,null,null,"PAN",3.3333333333333335,null,null,null,null,"PAN",0,null,null,null,null,"PS",807.33333333333337,null,null,null,null,"CDS/PP",432.5,null,null,null,null,"PS",828.5,null,null,null,null,"CDS/PP",305.33333333333331,null,null,null,null,"CDS/PP",250]
[null,null,null,null,"CDU",3,null,null,null,null,"PPD/PSD",0,null,null,null,null,"CDU",754.5,null,null,null,null,"CDS/PP",397.5,null,null,null,null,"PS",760,null,null,null,null,"BE",279,null,null,null,null,"PAN",203.2]
[null,"Partidos","Divisões por 1, 2, 3, 4, etc",null,"BE",3,null,"Partidos","Divisões por 1, 2, 3, 4, etc",null,"IOMAF",0,null,"Partidos","Divisões por 1, 2, 3, 4, etc",null,"IOMAF",652.75,null,"Partidos","Divisões por 1, 2, 3, 4, etc",null,"PS",390.8,null,"Partidos","Divisões por 1, 2, 3, 4, etc",null,"CDU",722.25,null,"Partidos","Divisões por 1, 2, 3, 4, etc",null,"PS",275,null,"Partidos","Divisões por 1, 2, 3, 4, etc",null,"MMS",200]
[null,"PS",{"$f":"C7/1","v":2967},null,"CDS/PP",2.6666666666666665,null,"CDU",{"$f":"I7/1","v":{"$error":"#REF!"}},null,"CDS/PP",0,null,"IOMAF",{"$f":"O7/1","v":854},null,"CDS/PP",605.5,null,"IOMAF",{"$f":"U7/1","v":1954},null,"IOMAF",373,null,"IOMAF",{"$f":"AA7/1","v":3800},null,"CDS/PP",633.33333333333337,null,"IOMAF",{"$f":"AG7/1","v":916},null,"CDS/PP",255.66666666666666,null,"IOMAF",{"$f":"AM7/1","v":346},null,"MMS",178]
[null,"PPD/PSD",{"$f":"C8/1","v":106},null,"PCTP/MRPP",2.5,null,"BE",{"$f":"I8/1","v":{"$error":"#REF!"}},null,"PS",0,null,"CDS/PP",{"$f":"O8/1","v":3018},null,"PPD/PSD",603.6,null,"CDS/PP",{"$f":"U8/1","v":746},null,"IOMAF",346,null,"CDS/PP",{"$f":"AA8/1","v":2889},null,"PPD/PSD",577.79999999999995,null,"CDS/PP",{"$f":"AG8/1","v":164},null,"MMS",229,null,"CDS/PP",{"$f":"AM8/1","v":356},null,"BE",173]
[null,"PTP",{"$f":"C9/1","v":255},null,"PTP",2.4,null,"PAN",{"$f":"I9/1","v":{"$error":"#REF!"}},null,"CDU",0,null,"PS",{"$f":"O9/1","v":455},null,"BE",522.20000000000005,null,"PS",{"$f":"U9/1","v":795},null,"CDS/PP",325.66666666666669,null,"PS",{"$f":"AA9/1","v":477},null,"CDS/PP",552.33333333333337,null,"PS",{"$f":"AG9/1","v":275},null,"MMS",219.14285714285714,null,"PS",{"$f":"AM9/1","v":1000},null,"CDU",169.33333333333334]
[null,"IOMAF",{"$f":"C10/1","v":196},null,"PS",2,null,"PPD/PSD",{"$f":"I10/1","v":{"$error":"#REF!"}},null,"BE",0,null,"PPD/PSD",{"$f":"O10/1","v":2611},null,"PS",503,null,"PPD/PSD",{"$f":"U10/1","v":320},null,"PPD/PSD",320,null,"PPD/PSD",{"$f":"AA10/1","v":1657},null,"IOMAF",542.85714285714289,null,"PPD/PSD",{"$f":"AG10/1","v":1534},null,"CDS/PP",209.25,null,"PPD/PSD",{"$f":"AM10/1","v":1016},null,"PPD/PSD",166.66666666666666]
[null,"PCTP/MRPP",4554,null,"PAN",2,null,"IOMAF",{"$f":"I11/1","v":{"$error":"#REF!"}},null,"PAN",0,null,"CDU",{"$f":"O11/1","v":2422},null,"IOMAF",484.4,null,"CDU",{"$f":"U11/1","v":1730},null,"BE",288.33333333333331,null,"CDU",{"$f":"AA11/1","v":935},null,"PS",481.5,null,"CDU",{"$f":"AG11/1","v":837},null,"PS",191.75,null,"CDU",{"$f":"AM11/1","v":123},null,"CDS/PP",145.14285714285714]
[null,"BE",{"$f":"C12/1","v":72},null,"BE",2,null,"CDS/PP",{"$f":"I7/2","v":{"$error":"#REF!"}},null,"PPD/PSD",0,null,"BE",{"$f":"O7/2","v":427},null,"PS",455,null,"BE",{"$f":"U7/2","v":977},null,"IOMAF",279.14285714285717,null,"BE",{"$f":"AA7/2","v":1900},null,"PS",477,null,"BE",{"$f":"AG7/2","v":458},null,"PS",183.2,null,"BE",{"$f":"AM7/2","v":173},null,"IOMAF",142.85714285714286]
[null,"CDS/PP",{"$f":"C7/2","v":1483.5},null,"IOMAF",2,null,"PS",{"$f":"I8/2","v":{"$error":"#REF!"}},null,"IOMAF",0,null,"IOMAF",{"$f":"O8/2","v":1509},null,"CDU",435.16666666666669,null,"IOMAF",{"$f":"U8/2","v":373},null,"IOMAF",265,null,"IOMAF",{"$f":"AA8/2","v":1444.5},null,"CDS/PP",475,null,"MMS",{"$f":"AG8/2","v":82},null,"PAN",170.44444444444446,null,"MMS",{"$f":"AM8/2","v":178},null,"MMS",127]
[null,"PAN",{"$f":"C8/2","v":53},null,"PPD/PSD",2,null,"CDU",{"$f":"I9/2","v":{"$error":"#REF!"}},null,"CDS/PP",0,null,"CDS/PP",{"$f":"O9/2","v":227.5},null,"CDS/PP",431.14285714285717,null,"CDS/PP",{"$f":"U9/2","v":397.5},null,"BE",248.66666666666666,null,"CDS/PP",{"$f":"AA9/2","v":238.5},null,"PPD/PSD",467.5,null,"PAN",{"$f":"AG9/2","v":137.5},null,"MMS",167.4,null,"PAN",{"$f":"AM9/2","v":500},null,"BE",125]
[null,"CDU",127.5,null,"CDU",2,null,"BE",{"$f":"I10/2","v":{"$error":"#REF!"}},null,"PS",0,null,"PS",{"$f":"O10/2","v":1305.5},null,"BE",427,null,"PS",{"$f":"U10/2","v":160},null,"CDU",247.14285714285714,null,"PS",{"$f":"AA10/2","v":828.5},null,"IOMAF",422.22222222222223,null,"PTP",{"$f":"AG10/2","v":767},null,"CDS/PP",164,null,"IOMAF",{"$f":"AM10/2","v":508},null,"CDU",123]
[null,"PS",{"$f":"C10/2","v":98},null,"PS",1.7142857142857142,null,"PAN",{"$f":"I11/2","v":{"$error":"#REF!"}},null,"CDU",0,null,"PPD/PSD",{"$f":"O11/2","v":1211},null,"BE",403.66666666666669,null,"PPD/PSD",{"$f":"U11/2","v":865},null,"BE",244.25,null,"PPD/PSD",{"$f":"AA11/2","v":467.5},null,"IOMAF",414.25,null,"IOMAF",{"$f":"AG11/2","v":418.5},null,"PPD/PSD",153.4,null,"CDS/PP",{"$f":"AM11/2","v":61.5},null,"PPD/PSD",118.66666666666667]
[null,"PPD/PSD",2277,null,"PAN",1.6666666666666667,null,"PPD/PSD",{"$f":"I7/3","v":{"$error":"#REF!"}},null,"BE",0,null,"CDU",{"$f":"O7/3","v":284.66666666666669},null,"IOMAF",377.25,null,"CDU",{"$f":"U7/3","v":651.33333333333337},null,"CDU",217.11111111111111,null,"CDU",{"$f":"AA7/3","v":1266.6666666666667},null,"CDS/PP",412.71428571428572,null,"CDS/PP",{"$f":"AG7/3","v":305.33333333333331},null,"PAN",152.66666666666666,null,"PS",{"$f":"AM7/3","v":115.33333333333333},null,"PS",115.33333333333333]
[null,"PTP",36,null,"PS",1.6,null,"IOMAF",{"$f":"I8/3","v":{"$error":"#REF!"}},null,"PAN",0,null,"BE",{"$f":"O8/3","v":1006},null,"PPD/PSD",373,null,"BE",{"$f":"U8/3","v":248.66666666666666},null,"PPD/PSD",216.25,null,"BE",{"$f":"AA8/3","v":963},null,"BE",380,null,"PS",{"$f":"AG8/3","v":54.666666666666664},null,"PS",139.5,null,"PPD/PSD",{"$f":"AM8/3","v":118.66666666666667},null,"PPD/PSD",112.88888888888889]
[null,"IOMAF",{"$f":"C7/3","v":989},null,"PTP",1.5,null,"CDS/PP",{"$f":"I9/3","v":{"$error":"#REF!"}},null,"PPD/PSD",0,null,"IOMAF",{"$f":"O9/3","v":151.66666666666666},null,"CDU",346,null,"IOMAF",{"$f":"U9/3","v":265},null,"BE",198.75,null,"IOMAF",{"$f":"AA9/3","v":159},null,"PS",361.125,null,"PPD/PSD",{"$f":"AG9/3","v":91.666666666666671},null,"PTP",139.45454545454547,null,"CDU",{"$f":"AM9/3","v":333.33333333333331},null,"PS",111.11111111111111]
[null,"PCTP/MRPP",35.333333333333336,null,"CDS/PP",1.5,null,"PS",{"$f":"I10/3","v":{"$error":"#REF!"}},null,"IOMAF",0,null,"CDS/PP",{"$f":"O10/3","v":870.33333333333337},null,"BE",335.33333333333331,null,"CDS/PP",{"$f":"U10/3","v":106.66666666666667},null,"PPD/PSD",195.4,null,"CDS/PP",{"$f":"AA10/3","v":552.33333333333337},null,"CDU",345.45454545454544,null,"CDU",{"$f":"AG10/3","v":511.33333333333331},null,"PAN",137.5,null,"BE",{"$f":"AM10/3","v":338.66666666666669},null,"IOMAF",101.6]
[null,"BE",85,null,"PCTP/MRPP",1.4285714285714286,null,"CDU",{"$f":"I11/3","v":{"$error":"#REF!"}},null,"CDS/PP",0,null,"PS",{"$f":"O11/3","v":807.33333333333337},null,"PS",326.375,null,"PS",{"$f":"U11/3","v":576.66666666666663},null,"PS",192.22222222222223,null,"PS",{"$f":"AA11/3","v":311.66666666666669},null,"BE",331.4,null,"BE",{"$f":"AG11/3","v":279},null,"PPD/PSD",130.85714285714286,null,"MMS",{"$f":"AM11/3","v":41},null,"PAN",100]
[null,"CDS/PP",65.333333333333329,null,"PCTP/MRPP",1.3333333333333333,null,"BE",{"$f":"I7/4","v":{"$error":"#REF!"}},null,"PS",0,null,"PPD/PSD",{"$f":"O7/4","v":213.5},null,"PPD/PSD",302.75,null,"PPD/PSD",{"$f":"U7/4","v":488.5},null,"CDU",186.5,null,"PPD/PSD",{"$f":"AA7/4","v":950},null,"CDS/PP",321,null,"MMS",{"$f":"AG7/4","v":229},null,"CDU",127.83333333333333,null,"PAN",{"$f":"AM7/4","v":86.5},null,"BE",92.36363636363636]
[null,"PAN",1518,null,"CDS/PP",1.3333333333333333,null,"PAN",{"$f":"I8/4","v":{"$error":"#REF!"}},null,"CDU",0,null,"CDU",{"$f":"O8/4","v":754.5},null,"CDU",301.8,null,"CDU",{"$f":"U8/4","v":186.5},null,"PS",177.63636363636363,null,"CDU",{"$f":"AA8/4","v":722.25},null,"PPD/PSD",316.66666666666669,null,"PAN",{"$f":"AG8/4","v":41},null,"PAN",119.57142857142857,null,"IOMAF",{"$f":"AM8/4","v":89},null,"CDU",90.909090909090907]
[null,"CDU",24,null,"IOMAF",1.3333333333333333,null,"PPD/PSD",{"$f":"I9/4","v":{"$error":"#REF!"}},null,"CDU",0,null,"BE",{"$f":"O9/4","v":113.75},null,"CDS/PP",290.11111111111109,null,"BE",{"$f":"U9/4","v":198.75},null,"CDS/PP",173,null,"BE",{"$f":"AA9/4","v":119.25},null,"PS",311.66666666666669,null,"PTP",{"$f":"AG9/4","v":68.75},null,"IOMAF",118,null,"CDS/PP",{"$f":"AM9/4","v":250},null,"IOMAF",89]
[null,"PS",{"$f":"C7/4","v":741.75},null,"BE",1.25,null,"IOMAF",{"$f":"I10/4","v":{"$error":"#REF!"}},null,"BE",0,null,"IOMAF",{"$f":"O10/4","v":652.75},null,"CDU",284.66666666666669,null,"IOMAF",{"$f":"U10/4","v":80},null,"CDS/PP",162.83333333333334,null,"IOMAF",{"$f":"AA10/4","v":414.25},null,"PS",292.30769230769232,null,"IOMAF",{"$f":"AG10/4","v":383.5},null,"PTP",114.5,null,"PS",{"$f":"AM10/4","v":254},null,"PAN",86.5]
[null,"PPD/PSD",26.5,null,"CDU",1.2,null,"CDS/PP",{"$f":"I11/4","v":{"$error":"#REF!"}},null,"PAN",0,null,"CDS/PP",{"$f":"O11/4","v":605.5},null,"PPD/PSD",274.36363636363637,null,"CDS/PP",{"$f":"U11/4","v":432.5},null,"PS",160,null,"CDS/PP",{"$f":"AA11/4","v":233.75},null,"IOMAF",288.89999999999998,null,"CDS/PP",{"$f":"AG11/4","v":209.25},null,"BE",109.57142857142857,null,"PPD/PSD",{"$f":"AM11/4","v":30.75},null,"PS",84.666666666666671]
[null,"PTP",63.75,null,"PS",1.2,null,"PS",{"$f":"I7/5","v":{"$error":"#REF!"}},null,"PPD/PSD",0,null,"PS",{"$f":"O7/5","v":170.8},null,"PS",269.11111111111109,null,"PS",{"$f":"U7/5","v":390.8},null,"CDU",159,null,"PS",{"$f":"AA7/5","v":760},null,"CDU",276.16666666666669,null,"PS",{"$f":"AG7/5","v":183.2},null,"PPD/PSD",104.625,null,"CDU",{"$f":"AM7/5","v":69.2},null,"CDS/PP",83.333333333333329]
[null,"IOMAF",49,null,"IOMAF",1.1428571428571428,null,"CDU",{"$f":"I8/5","v":{"$error":"#REF!"}},null,"IOMAF",0,null,"PPD/PSD",{"$f":"O8/5","v":603.6},null,"IOMAF",261.10000000000002,null,"PPD/PSD",{"$f":"U8/5","v":149.19999999999999},null,"IOMAF",157.27272727272728,null,"PPD/PSD",{"$f":"AA8/5","v":577.79999999999995},null,"CDS/PP",271.42857142857144,null,"PPD/PSD",{"$f":"AG8/5","v":32.799999999999997},null,"CDS/PP",102.26666666666667,null,"BE",{"$f":"AM8/5","v":71.2},null,"IOMAF",78.15384615384616]
[null,"PCTP/MRPP",1138.5,null,"PTP",1.1111111111111112,null,"BE",{"$f":"I9/5","v":{"$error":"#REF!"}},null,"CDS/PP",0,null,"CDU",{"$f":"O9/5","v":91},null,"CDS/PP",251.5,null,"CDU",{"$f":"U9/5","v":159},null,"IOMAF",150.30769230769232,null,"CDU",{"$f":"AA9/5","v":95.4},null,"BE",262.63636363636363,null,"CDU",{"$f":"AG9/5","v":55},null,"CDU",101.77777777777777,null,"MMS",{"$f":"AM9/5","v":200},null,"MMS",76.92307692307692]
[null,"BE",18,null,"CDS/PP",1.0909090909090908,null,"PAN",{"$f":"I10/5","v":{"$error":"#REF!"}},null,"PS",0,null,"BE",{"$f":"O10/5","v":522.20000000000005},null,"CDS/PP",242.2,null,"BE",{"$f":"U10/5","v":64},null,"PPD/PSD",149.19999999999999,null,"BE",{"$f":"AA10/5","v":331.4},null,"PS",253.33333333333334,null,"BE",{"$f":"AG10/5","v":306.8},null,"MMS",95.875,null,"PAN",{"$f":"AM10/5","v":203.2},null,"BE",72.571428571428569]
[null,"CDS/PP",{"$f":"C7/5","v":593.4},null,"CDS/PP",1,null,"PPD/PSD",{"$f":"I11/5","v":{"$error":"#REF!"}},null,"CDU",0,null,"IOMAF",{"$f":"O11/5","v":484.4},null,"BE",237.36363636363637,null,"IOMAF",{"$f":"U11/5","v":346},null,"BE",144.16666666666666,null,"IOMAF",{"$f":"AA11/5","v":187},null,"CDU",240.75,null,"MMS",{"$f":"AG11/5","v":167.4},null,"PTP",93,null,"IOMAF",{"$f":"AM11/5","v":24.6},null,"CDU",71.428571428571431]
[null,"PAN",21.2,null,"PPD/PSD",1,null,"IOMAF",{"$f":"I7/6","v":{"$error":"#REF!"}},null,"BE",0,null,"CDS/PP",{"$f":"O7/6","v":142.33333333333334},null,"IOMAF",232.15384615384616,null,"CDS/PP",{"$f":"U7/6","v":325.66666666666669},null,"BE",139.57142857142858,null,"CDS/PP",{"$f":"AA7/6","v":633.33333333333337},null,"CDS/PP",238.5,null,"PAN",{"$f":"AG7/6","v":152.66666666666666},null,"PPD/PSD",91.666666666666671,null,"CDS/PP",{"$f":"AM7/6","v":57.666666666666664},null,"BE",71.2]
[null,"CDU",51,null,"BE",1,null,"CDS/PP",{"$f":"I8/6","v":{"$error":"#REF!"}},null,"PAN",0,null,"PS",{"$f":"O8/6","v":503},null,"CDS/PP",227.5,null,"PS",{"$f":"U8/6","v":124.33333333333333},null,"CDU",133.07692307692307,null,"PS",{"$f":"AA8/6","v":481.5},null,"CDS/PP",237.5,null,"PTP",{"$f":"AG8/6","v":27.333333333333332},null,"IOMAF",91.6,null,"PS",{"$f":"AM8/6","v":59.333333333333336},null,"CDU",69.2]
[null,"PS",39.200000000000003,null,"PCTP/MRPP",1,null,"PS",{"$f":"I9/6","v":{"$error":"#REF!"}},null,"PPD/PSD",0,null,"PPD/PSD",{"$f":"O9/6","v":75.833333333333329},null,"IOMAF",220.18181818181819,null,"PPD/PSD",{"$f":"U9/6","v":132.5},null,"PPD/PSD",132.5,null,"PPD/PSD",{"$f":"AA9/6","v":79.5},null,"PPD/PSD",236.71428571428572,null,"IOMAF",{"$f":"AG9/6","v":45.833333333333336},null,"PS",90.235294117647058,null,"PPD/PSD",{"$f":"AM9/6","v":166.66666666666666},null,"PS",67.733333333333334]
[null,"PPD/PSD",910.8,null,"CDU",1,null,"CDU",{"$f":"I10/6","v":{"$error":"#REF!"}},null,"IOMAF",0,null,"CDU",{"$f":"O10/6","v":435.16666666666669},null,"PPD/PSD",217.58333333333334,null,"CDU",{"$f":"U10/6","v":53.333333333333336},null,"CDU",130.26666666666668,null,"CDU",{"$f":"AA10/6","v":276.16666666666669},null,"CDS/PP",233.75,null,"CDS/PP",{"$f":"AG10/6","v":255.66666666666666},null,"PAN",85.222222222222229,null,"CDU",{"$f":"AM10/6","v":169.33333333333334},null,"CDS/PP",66.666666666666671]
[null,"PTP",14.4,null,"IOMAF",1,null,"CDU",{"$f":"I11/6","v":{"$error":"#REF!"}},null,"CDS/PP",0,null,"BE",{"$f":"O11/6","v":403.66666666666669},null,"BE",215.57142857142858,null,"BE",{"$f":"U11/6","v":288.33333333333331},null,"PS",124.33333333333333,null,"BE",{"$f":"AA11/6","v":155.83333333333334},null,"IOMAF",223.52941176470588,null,"PS",{"$f":"AG11/6","v":139.5},null,"CDU",83.7,null,"BE",{"$f":"AM11/6","v":20.5},null,"PAN",63.5]
[null,"IOMAF",{"$f":"C7/6","v":494.5},null,"PPD/PSD",0.92307692307692313,null,"BE",{"$f":"I7/7","v":{"$error":"#REF!"}},null,"PS",0,null,"IOMAF",{"$f":"O7/7","v":122},null,"PPD/PSD",213.5,null,"IOMAF",{"$f":"U7/7","v":279.14285714285717},null,"PPD/PSD",123.57142857142857,null,"IOMAF",{"$f":"AA7/7","v":542.85714285714289},null,"PPD/PSD",222.23076923076923,null,"PPD/PSD",{"$f":"AG7/7","v":130.85714285714286},null,"BE",83.272727272727266,null,"MMS",{"$f":"AM7/7","v":49.428571428571431},null,"MMS",62.5]
[null,"PCTP/MRPP",17.666666666666668,null,"BE",0.90909090909090906,null,"PAN",{"$f":"I8/7","v":{"$error":"#REF!"}},null,"CDU",0,null,"CDS/PP",{"$f":"O8/7","v":431.14285714285717},null,"CDU",201.83333333333334,null,"CDS/PP",{"$f":"U8/7","v":106.57142857142857},null,"PPD/PSD",122.125,null,"CDS/PP",{"$f":"AA8/7","v":412.71428571428572},null,"BE",211.11111111111111,null,"CDU",{"$f":"AG8/7","v":23.428571428571427},null,"MMS",82,null,"PAN",{"$f":"AM8/7","v":50.857142857142854},null,"CDS/PP",61.5]
[null,"BE",42.5,null,"PPD/PSD",0.88888888888888884,null,"PPD/PSD",{"$f":"I9/7","v":{"$error":"#REF!"}},null,"BE",0,null,"PS",{"$f":"O9/7","v":65},null,"CDU",201.2,null,"PS",{"$f":"U9/7","v":113.57142857142857},null,"PS",115.33333333333333,null,"PS",{"$f":"AA9/7","v":68.142857142857139},null,"CDU",207.125,null,"BE",{"$f":"AG9/7","v":39.285714285714285},null,"PPD/PSD",80.736842105263165,null,"IOMAF",{"$f":"AM9/7","v":142.85714285714286},null,"CDU",59.764705882352942]
[null,"CDS/PP",32.666666666666664,null,"PTP",0.8571428571428571,null,"IOMAF",{"$f":"I10/7","v":{"$error":"#REF!"}},null,"PAN",0,null,"PPD/PSD",{"$f":"O10/7","v":373},null,"PS",200.84615384615384,null,"PPD/PSD",{"$f":"U10/7","v":45.714285714285715},null,"PS",114.94117647058823,null,"PPD/PSD",{"$f":"AA10/7","v":236.71428571428572},null,"PS",206.35714285714286,null,"MMS",{"$f":"AG10/7","v":219.14285714285714},null,"PTP",76.7,null,"CDS/PP",{"$f":"AM10/7","v":145.14285714285714},null,"PS",59.333333333333336]
[null,"PAN",759,null,"PAN",0.8571428571428571,null,"CDS/PP",{"$f":"I11/7","v":{"$error":"#REF!"}},null,"PPD/PSD",0,null,"CDU",{"$f":"O11/7","v":346},null,"PPD/PSD",188.625,null,"CDU",{"$f":"U11/7","v":247.14285714285714},null,"PS",113.57142857142857,null,"IOMAF",{"$f":"AA11/7","v":133.57142857142858},null,"CDU",200,null,"PAN",{"$f":"AG11/7","v":119.57142857142857},null,"CDS/PP",76.333333333333329,null,"PS",{"$f":"AM11/7","v":17.571428571428573},null,"PPD/PSD",58.823529411764703]
[null,"CDU",12,null,"PTP",0.83333333333333337,null,"PS",{"$f":"I7/8","v":{"$error":"#REF!"}},null,"IOMAF",0,null,"BE",{"$f":"O7/8","v":106.75},null,"CDS/PP",186.5,null,"BE",{"$f":"U7/8","v":244.25},null,"CDS/PP",108.55555555555556,null,"CDS/PP",{"$f":"AA7/8","v":475},null,"PPD/PSD",192.6,null,"PTP",{"$f":"AG7/8","v":114.5},null,"IOMAF",76.090909090909093,null,"PPD/PSD",{"$f":"AM7/8","v":43.25},null,"CDS/PP",57.666666666666664]
[null,"PS",{"$f":"C7/7","v":423.85714285714283},null,"PAN",0.8,null,"CDU",{"$f":"I8/8","v":{"$error":"#REF!"}},null,"CDS/PP",0,null,"IOMAF",{"$f":"O8/8","v":377.25},null,"PPD/PSD",186.30769230769232,null,"IOMAF",{"$f":"U8/8","v":93.25},null,"CDS/PP",108.125,null,"PS",{"$f":"AA8/8","v":361.125},null,"PPD/PSD",190,null,"IOMAF",{"$f":"AG8/8","v":20.5},null,"CDU",73.047619047619051,null,"CDU",{"$f":"AM8/8","v":44.5},null,"CDS/PP",56.444444444444443]
[null,"PPD/PSD",15.142857142857142,null,"PAN",0.8,null,"BE",{"$f":"I9/8","v":{"$error":"#REF!"}},null,"PS",0,null,"CDS/PP",{"$f":"O9/8","v":56.875},null,"PS",177.52941176470588,null,"CDS/PP",{"$f":"U9/8","v":99.375},null,"CDS/PP",106.66666666666667,null,"PPD/PSD",{"$f":"AA9/8","v":59.625},null,"IOMAF",187,null,"CDS/PP",{"$f":"AG9/8","v":34.375},null,"MMS",70.461538461538467,null,"BE",{"$f":"AM9/8","v":125},null,"IOMAF",55.555555555555557]
[null,"PTP",36.428571428571431,null,"PS",0.76923076923076927,null,"PAN",{"$f":"I10/8","v":{"$error":"#REF!"}},null,"CDU",0,null,"PS",{"$f":"O10/8","v":326.375},null,"IOMAF",174.06666666666666,null,"PS",{"$f":"U10/8","v":40},null,"CDS/PP",106.57142857142857,null,"CDU",{"$f":"AA10/8","v":207.125},null,"PPD/PSD",184.11111111111111,null,"PS",{"$f":"AG10/8","v":191.75},null,"BE",69.75,null,"MMS",{"$f":"AM10/8","v":127},null,"MMS",53.473684210526315]
[null,"IOMAF",28,null,"IOMAF",0.75,null,"PPD/PSD",{"$f":"I11/8","v":{"$error":"#REF!"}},null,"BE",0,null,"PPD/PSD",{"$f":"O11/8","v":302.75},null,"PS",173,null,"PPD/PSD",{"$f":"U11/8","v":216.25},null,"IOMAF",102.84210526315789,null,"BE",{"$f":"AA11/8","v":116.875},null,"IOMAF",180.95238095238096,null,"PPD/PSD",{"$f":"AG11/8","v":104.625},null,"IOMAF",69.727272727272734,null,"PAN",{"$f":"AM11/8","v":15.375},null,"BE",52.631578947368418]
[null,"PCTP/MRPP",650.57142857142856,null,"PCTP/MRPP",0.72727272727272729,null,"IOMAF",{"$f":"I7/9","v":{"$error":"#REF!"}},null,"PAN",0,null,"CDU",{"$f":"O7/9","v":94.888888888888886},null,"PS",170.8,null,"CDU",{"$f":"U7/9","v":217.11111111111111},null,"IOMAF",101.76470588235294,null,"IOMAF",{"$f":"AA7/9","v":422.22222222222223},null,"PS",180.5625,null,"CDU",{"$f":"AG7/9","v":101.77777777777777},null,"PTP",68.75,null,"IOMAF",{"$f":"AM7/9","v":38.444444444444443},null,"PAN",50.857142857142854]
[null,"PS",10.285714285714286,null,"CDS/PP",0.7142857142857143,null,"CDS/PP",{"$f":"I8/9","v":{"$error":"#REF!"}},null,"PPD/PSD",0,null,"BE",{"$f":"O8/9","v":335.33333333333331},null,"CDS/PP",167.66666666666666,null,"BE",{"$f":"U8/9","v":82.888888888888886},null,"CDS/PP",99.375,null,"CDS/PP",{"$f":"AA8/9","v":321},null,"BE",172.72727272727272,null,"BE",{"$f":"AG8/9","v":18.222222222222221},null,"BE",66.695652173913047,null,"CDS/PP",{"$f":"AM8/9","v":39.555555555555557},null,"PPD/PSD",50.8]
[null,"PPD/PSD",{"$f":"C7/8","v":370.875},null,"IOMAF",0.66666666666666663,null,"PS",{"$f":"I9/9","v":{"$error":"#REF!"}},null,"IOMAF",0,null,"IOMAF",{"$f":"O9/9","v":50.555555555555557},null,"BE",163.1875,null,"IOMAF",{"$f":"U9/9","v":88.333333333333329},null,"BE",97.7,null,"PS",{"$f":"AA9/9","v":53},null,"CDS/PP",169.94117647058823,null,"MMS",{"$f":"AG9/9","v":30.555555555555557},null,"PS",65.428571428571431,null,"PS",{"$f":"AM9/9","v":111.11111111111111},null,"PS",50]
[null,"PTP",13.25,null,"PCTP/MRPP",0.66666666666666663,null,"CDU",{"$f":"I10/9","v":{"$error":"#REF!"}},null,"CDS/PP",0,null,"CDS/PP",{"$f":"O10/9","v":290.11111111111109},null,"CDS/PP",161.46666666666667,null,"CDS/PP",{"$f":"U10/9","v":35.555555555555557},null,"BE",96.111111111111114,null,"PPD/PSD",{"$f":"AA10/9","v":184.11111111111111},null,"PS",165.7,null,"PAN",{"$f":"AG10/9","v":170.44444444444446},null,"CDS/PP",64.384615384615387,null,"PPD/PSD",{"$f":"AM10/9","v":112.88888888888889},null,"MMS",49.428571428571431]
[null,"IOMAF",31.875,null,"PS",0.66666666666666663,null,"BE",{"$f":"I11/9","v":{"$error":"#REF!"}},null,"PS",0,null,"PS",{"$f":"O11/9","v":269.11111111111109},null,"IOMAF",158.84210526315789,null,"PS",{"$f":"U11/9","v":192.22222222222223},null,"IOMAF",93.25,null,"CDU",{"$f":"AA11/9","v":103.88888888888889},null,"CDU",165.21739130434781,null,"PTP",{"$f":"AG11/9","v":93},null,"CDS/PP",63.916666666666664,null,"CDU",{"$f":"AM11/9","v":13.666666666666666},null,"IOMAF",48.38095238095238]
[null,"PCTP/MRPP",24.5,null,"PPD/PSD",0.66666666666666663,null,"PAN",{"$f":"I7/10","v":{"$error":"#REF!"}},null,"CDU",0,null,"PPD/PSD",{"$f":"O7/10","v":85.4},null,"CDU",153.58823529411765,null,"PPD/PSD",{"$f":"U7/10","v":195.4},null,"CDU",93.047619047619051,null,"BE",{"$f":"AA7/10","v":380},null,"IOMAF",160.5,null,"IOMAF",{"$f":"AG7/10","v":91.6},null,"MMS",61.36,null,"BE",{"$f":"AM7/10","v":34.6},null,"PAN",47.61904761904762]
[null,"BE",569.25,null,"PAN",0.61538461538461542,null,"PPD/PSD",{"$f":"I8/10","v":{"$error":"#REF!"}},null,"CDU",0,null,"CDU",{"$f":"O8/10","v":301.8},null,"IOMAF",151.66666666666666,null,"CDU",{"$f":"U8/10","v":74.599999999999994},null,"CDU",91.05263157894737,null,"IOMAF",{"$f":"AA8/10","v":288.89999999999998},null,"IOMAF",159,null,"CDS/PP",{"$f":"AG8/10","v":16.399999999999999},null,"PAN",61.06666666666667,null,"MMS",{"$f":"AM8/10","v":35.6},null,"BE",46.18181818181818]
[null,"CDS/PP",9,null,"CDS/PP",0.6,null,"IOMAF",{"$f":"I9/10","v":{"$error":"#REF!"}},null,"BE",0,null,"BE",{"$f":"O9/10","v":45.5},null,"IOMAF",151.375,null,"BE",{"$f":"U9/10","v":79.5},null,"PPD/PSD",88.818181818181813,null,"CDS/PP",{"$f":"AA9/10","v":47.7},null,"PPD/PSD",158.33333333333334,null,"PS",{"$f":"AG9/10","v":27.5},null,"MMS",59.785714285714285,null,"PAN",{"$f":"AM9/10","v":100},null,"CDU",45.454545454545453]
[null,"PAN",{"$f":"C7/9","v":329.66666666666669},null,"PPD/PSD",0.5714285714285714,null,"CDS/PP",{"$f":"I10/10","v":{"$error":"#REF!"}},null,"PAN",0,null,"IOMAF",{"$f":"O10/10","v":261.10000000000002},null,"BE",150.9,null,"IOMAF",{"$f":"U10/10","v":32},null,"IOMAF",88.333333333333329,null,"PS",{"$f":"AA10/10","v":165.7},null,"BE",155.83333333333334,null,"PPD/PSD",{"$f":"AG10/10","v":153.4},null,"PPD/PSD",59,null,"IOMAF",{"$f":"AM10/10","v":101.6},null,"CDU",44.5]
[null,"CDU",11.777777777777779,null,"BE",0.5714285714285714,null,"PS",{"$f":"I11/10","v":{"$error":"#REF!"}},null,"PPD/PSD",0,null,"CDS/PP",{"$f":"O11/10","v":242.2},null,"PPD/PSD",145.05555555555554,null,"CDS/PP",{"$f":"U11/10","v":173},null,"PPD/PSD",86.5,null,"PPD/PSD",{"$f":"AA11/10","v":93.5},null,"BE",152.05263157894737,null,"CDU",{"$f":"AG11/10","v":83.7},null,"PPD/PSD",57.25,null,"CDS/PP",{"$f":"AM11/10","v":12.3},null,"PS",44.173913043478258]
[null,"PS",28.333333333333332,null,"IOMAF",0.54545454545454541,null,"CDU",{"$f":"I7/11","v":{"$error":"#REF!"}},null,"IOMAF",0,null,"PS",{"$f":"O7/11","v":77.63636363636364},null,"CDU",143.71428571428572,null,"PS",{"$f":"U7/11","v":177.63636363636363},null,"PS",84.956521739130437,null,"CDU",{"$f":"AA7/11","v":345.45454545454544},null,"PS",152,null,"BE",{"$f":"AG7/11","v":83.272727272727266},null,"PS",55.8,null,"PS",{"$f":"AM7/11","v":31.454545454545453},null,"CDS/PP",43.478260869565219]
[null,"PPD/PSD",21.777777777777779,null,"PS",0.5,null,"BE",{"$f":"I8/11","v":{"$error":"#REF!"}},null,"CDS/PP",0,null,"PPD/PSD",{"$f":"O8/11","v":274.36363636363637},null,"BE",142.47058823529412,null,"PPD/PSD",{"$f":"U8/11","v":67.818181818181813},null,"BE",82.888888888888886,null,"BE",{"$f":"AA8/11","v":262.63636363636363},null,"CDS/PP",150.63636363636363,null,"MMS",{"$f":"AG8/11","v":14.909090909090908},null,"CDU",55,null,"PPD/PSD",{"$f":"AM8/11","v":32.363636363636367},null,"PPD/PSD",43.25]
[null,"PTP",506,null,"PTP",0.5,null,"PAN",{"$f":"I9/11","v":{"$error":"#REF!"}},null,"PS",0,null,"CDU",{"$f":"O9/11","v":41.363636363636367},null,"CDS/PP",142.33333333333334,null,"CDU",{"$f":"U9/11","v":72.272727272727266},null,"PS",82.38095238095238,null,"IOMAF",{"$f":"AA9/11","v":43.363636363636367},null,"CDS/PP",146.15384615384616,null,"PAN",{"$f":"AG9/11","v":25},null,"PS",54.666666666666664,null,"CDU",{"$f":"AM9/11","v":90.909090909090907},null,"PAN",42.333333333333336]
[null,"IOMAF",8,null,"PS",0.5,null,"PPD/PSD",{"$f":"I10/11","v":{"$error":"#REF!"}},null,"CDU",0,null,"BE",{"$f":"O10/11","v":237.36363636363637},null,"PS",137.42105263157896,null,"BE",{"$f":"U10/11","v":29.09090909090909},null,"CDS/PP",81.416666666666671,null,"CDS/PP",{"$f":"AA10/11","v":150.63636363636363},null,"CDU",144.44999999999999,null,"PTP",{"$f":"AG10/11","v":139.45454545454547},null,"PTP",53.882352941176471,null,"BE",{"$f":"AM10/11","v":92.36363636363636},null,"MMS",41.666666666666664]
[null,"PCTP/MRPP",{"$f":"C7/10","v":296.7},null,"CDS/PP",0.46153846153846156,null,"IOMAF",{"$f":"I11/11","v":{"$error":"#REF!"}},null,"BE",0,null,"IOMAF",{"$f":"O11/11","v":220.18181818181819},null,"PPD/PSD",137.18181818181819,null,"IOMAF",{"$f":"U11/11","v":157.27272727272728},null,"IOMAF",80,null,"PS",{"$f":"AA11/11","v":85},null,"CDU",140.74074074074073,null,"IOMAF",{"$f":"AG11/11","v":76.090909090909093},null,"PAN",52.3125,null,"MMS",{"$f":"AM11/11","v":11.181818181818182},null,"MMS",41]
[null,"BE",10.6,null,"CDU",0.44444444444444442,null,"CDS/PP",{"$f":"I7/12","v":{"$error":"#REF!"}},null,"PAN",0,null,"IOMAF",{"$f":"O7/12","v":71.166666666666671},null,"CDU",134.55555555555554,null,"CDS/PP",{"$f":"U7/12","v":162.83333333333334},null,"BE",79.5,null,"PPD/PSD",{"$f":"AA7/12","v":316.66666666666669},null,"IOMAF",138.08333333333334,null,"CDS/PP",{"$f":"AG7/12","v":76.333333333333329},null,"CDU",50.888888888888886,null,"PAN",{"$f":"AM7/12","v":28.833333333333332},null,"CDU",40.64]
[null,"CDS/PP",25.5,null,"PCTP/MRPP",0.42857142857142855,null,"PS",{"$f":"I8/12","v":{"$error":"#REF!"}},null,"PPD/PSD",0,null,"CDS/PP",{"$f":"O8/12","v":251.5},null,"CDS/PP",131.21739130434781,null,"PS",{"$f":"U8/12","v":62.166666666666664},null,"CDS/PP",78.63636363636364,null,"CDU",{"$f":"AA8/12","v":240.75},null,"CDS/PP",137.57142857142858,null,"PS",{"$f":"AG8/12","v":13.666666666666666},null,"PPD/PSD",49.235294117647058,null,"IOMAF",{"$f":"AM8/12","v":29.666666666666668},null,"PPD/PSD",40]
[null,"PAN",19.600000000000001,null,"CDS/PP",0.4,null,"CDU",{"$f":"I9/12","v":{"$error":"#REF!"}},null,"IOMAF",0,null,"PS",{"$f":"O9/12","v":37.916666666666664},null,"CDS/PP",130.55000000000001,null,"PPD/PSD",{"$f":"U9/12","v":66.25},null,"IOMAF",78.16,null,"BE",{"$f":"AA9/12","v":39.75},null,"IOMAF",133.57142857142858,null,"PPD/PSD",{"$f":"AG9/12","v":22.916666666666668},null,"IOMAF",48.210526315789473,null,"CDS/PP",{"$f":"AM9/12","v":83.333333333333329},null,"CDS/PP",39.555555555555557]
[null,"CDU",455.4,null,"BE",0.4,null,"CDU",{"$f":"I10/12","v":{"$error":"#REF!"}},null,"CDS/PP",0,null,"PPD/PSD",{"$f":"O10/12","v":217.58333333333334},null,"PPD/PSD",127.47368421052632,null,"CDU",{"$f":"U10/12","v":26.666666666666668},null,"IOMAF",75.217391304347828,null,"IOMAF",{"$f":"AA10/12","v":138.08333333333334},null,"IOMAF",131.31818181818181,null,"CDU",{"$f":"AG10/12","v":127.83333333333333},null,"PTP",46.5,null,"PS",{"$f":"AM10/12","v":84.666666666666671},null,"PS",39.07692307692308]
[null,"PS",7.2,null,"PTP",0.36363636363636365,null,"BE",{"$f":"I11/12","v":{"$error":"#REF!"}},null,"PS",0,null,"CDU",{"$f":"O11/12","v":201.83333333333334},null,"IOMAF",125.75,null,"BE",{"$f":"U11/12","v":144.16666666666666},null,"BE",75.15384615384616,null,"CDS/PP",{"$f":"AA11/12","v":77.916666666666671},null,"BE",127.46153846153847,null,"BE",{"$f":"AG11/12","v":69.75},null,"IOMAF",45.833333333333336,null,"PPD/PSD",{"$f":"AM11/12","v":10.25},null,"CDS/PP",38.46153846153846]
[null,"PPD/PSD",{"$f":"C7/11","v":269.72727272727275},null,"IOMAF",0.33333333333333331,null,"PAN",{"$f":"I7/13","v":{"$error":"#REF!"}},null,"CDU",0,null,"BE",{"$f":"O7/13","v":65.692307692307693},null,"IOMAF",124.33333333333333,null,"IOMAF",{"$f":"U7/13","v":150.30769230769232},null,"CDU",74.599999999999994,null,"PS",{"$f":"AA7/13","v":292.30769230769232},null,"BE",125.60869565217391,null,"MMS",{"$f":"AG7/13","v":70.461538461538467},null,"BE",45.8,null,"CDU",{"$f":"AM7/13","v":26.615384615384617},null,"IOMAF",38.444444444444443]
[null,"PTP",9.6363636363636367,null,"CDU",0.33333333333333331,null,"PPD/PSD",{"$f":"I8/13","v":{"$error":"#REF!"}},null,"BE",0,null,"IOMAF",{"$f":"O8/13","v":232.15384615384616},null,"IOMAF",122,null,"CDS/PP",{"$f":"U8/13","v":57.384615384615387},null,"CDU",72.370370370370367,null,"PPD/PSD",{"$f":"AA8/13","v":222.23076923076923},null,"CDU",120.375,null,"PAN",{"$f":"AG8/13","v":12.615384615384615},null,"CDU",44.05263157894737,null,"BE",{"$f":"AM8/13","v":27.384615384615383},null,"PS",37.037037037037038]
[null,"IOMAF",23.181818181818183,null,"BE",0.30769230769230771,null,"IOMAF",{"$f":"I9/13","v":{"$error":"#REF!"}},null,"PAN",0,null,"CDS/PP",{"$f":"O9/13","v":35},null,"PS",121.1,null,"PS",{"$f":"U9/13","v":61.153846153846153},null,"CDU",72.272727272727266,null,"CDU",{"$f":"AA9/13","v":36.692307692307693},null,"BE",119.25,null,"PTP",{"$f":"AG9/13","v":21.153846153846153},null,"CDS/PP",43.61904761904762,null,"MMS",{"$f":"AM9/13","v":76.92307692307692},null,"MMS",35.6]
[null,"PCTP/MRPP",17.818181818181817,null,"PS",0.2857142857142857,null,"CDS/PP",{"$f":"I10/13","v":{"$error":"#REF!"}},null,"PPD/PSD",0,null,"PS",{"$f":"O10/13","v":200.84615384615384},null,"BE",120.72,null,"PPD/PSD",{"$f":"U10/13","v":24.615384615384617},null,"BE",72.083333333333329,null,"BE",{"$f":"AA10/13","v":127.46153846153847},null,"IOMAF",118.35714285714286,null,"IOMAF",{"$f":"AG10/13","v":118},null,"IOMAF",41.85,null,"IOMAF",{"$f":"AM10/13","v":78.15384615384616},null,"BE",34.6]
[null,"BE",414,null,"IOMAF",0.2857142857142857,null,"PS",{"$f":"I11/13","v":{"$error":"#REF!"}},null,"CDU",0,null,"PPD/PSD",{"$f":"O11/13","v":186.30769230769232},null,"BE",118.68181818181819,null,"CDU",{"$f":"U11/13","v":133.07692307692307},null,"CDU",69.2,null,"IOMAF",{"$f":"AA11/13","v":71.92307692307692},null,"BE",116.875,null,"CDS/PP",{"$f":"AG11/13","v":64.384615384615387},null,"MMS",41.636363636363633,null,"CDS/PP",{"$f":"AM11/13","v":9.4615384615384617},null,"PPD/PSD",32.363636363636367]
[null,"CDS/PP",6.5454545454545459,null,"PPD/PSD",0.25,null,"CDU",{"$f":"I7/14","v":{"$error":"#REF!"}},null,"BE",0,null,"CDU",{"$f":"O7/14","v":61},null,"CDU",116.07692307692308,null,"BE",{"$f":"U7/14","v":139.57142857142858},null,"PPD/PSD",67.818181818181813,null,"CDS/PP",{"$f":"AA7/14","v":271.42857142857144},null,"PPD/PSD",115.56,null,"PS",{"$f":"AG7/14","v":65.428571428571431},null,"PAN",41,null,"PS",{"$f":"AM7/14","v":24.714285714285715},null,"PS",31.454545454545453]
[null,"PAN",{"$f":"C7/12","v":247.25},null,"PAN",0.22222222222222221,null,"BE",{"$f":"I8/14","v":{"$error":"#REF!"}},null,"PAN",0,null,"BE",{"$f":"O8/14","v":215.57142857142858},null,"CDS/PP",115.33333333333333,null,"IOMAF",{"$f":"U8/14","v":53.285714285714285},null,"PPD/PSD",66.538461538461533,null,"PS",{"$f":"AA8/14","v":206.35714285714286},null,"IOMAF",111.11538461538461,null,"PPD/PSD",{"$f":"AG8/14","v":11.714285714285714},null,"BE",39.857142857142854,null,"PPD/PSD",{"$f":"AM8/14","v":25.428571428571427},null,"PPD/PSD",30.75]
[null,"CDU",8.8333333333333339,null,"PCTP/MRPP",0.2,null,"PAN",{"$f":"I9/14","v":{"$error":"#REF!"}},null,"PPD/PSD",0,null,"IOMAF",{"$f":"O9/14","v":32.5},null,"BE",113.75,null,"CDS/PP",{"$f":"U9/14","v":56.785714285714285},null,"PPD/PSD",66.25,null,"PPD/PSD",{"$f":"AA9/14","v":34.071428571428569},null,"BE",110.46666666666667,null,"CDU",{"$f":"AG9/14","v":19.642857142857142},null,"PS",39.826086956521742,null,"CDU",{"$f":"AM9/14","v":71.428571428571431},null,"IOMAF",29.666666666666668]
[null,"PS",21.25,null,"PPD/PSD",0.18181818181818182,null,"PPD/PSD",{"$f":"I10/14","v":{"$error":"#REF!"}},null,"IOMAF",0,null,"CDS/PP",{"$f":"O10/14","v":186.5},null,"PPD/PSD",113.52173913043478,null,"PS",{"$f":"U10/14","v":22.857142857142858},null,"BE",64,null,"IOMAF",{"$f":"AA10/14","v":118.35714285714286},null,"BE",107,null,"BE",{"$f":"AG10/14","v":109.57142857142857},null,"BE",39.285714285714285,null,"BE",{"$f":"AM10/14","v":72.571428571428569},null,"PAN",28.833333333333332]
[null,"PPD/PSD",16.333333333333332,null,"PAN",0.16666666666666666,null,"IOMAF",{"$f":"I11/14","v":{"$error":"#REF!"}},null,"CDS/PP",0,null,"PS",{"$f":"O11/14","v":173},null,"PPD/PSD",111.77777777777777,null,"PPD/PSD",{"$f":"U11/14","v":123.57142857142857},null,"PS",62.166666666666664,null,"CDS/PP",{"$f":"AA11/14","v":66.785714285714292},null,"CDU",103.88888888888889,null,"MMS",{"$f":"AG11/14","v":59.785714285714285},null,"PAN",38.166666666666664,null,"MMS",{"$f":"AM11/14","v":8.7857142857142865},null,"BE",27.384615384615383]
[null,"PTP",379.5,null,"PCTP/MRPP",0.15384615384615385,null,"CDS/PP",{"$f":"I7/15","v":{"$error":"#REF!"}},null,"PS",0,null,"PPD/PSD",{"$f":"O7/15","v":56.93333333333333},null,"IOMAF",110.09090909090909,null,"CDU",{"$f":"U7/15","v":130.26666666666668},null,"PS",61.153846153846153,null,"PS",{"$f":"AA7/15","v":253.33333333333334},null,"CDU",103.5625,null,"PAN",{"$f":"AG7/15","v":61.06666666666667},null,"CDS/PP",38.045454545454547,null,"PAN",{"$f":"AM7/15","v":23.066666666666666},null,"CDU",26.615384615384617]
[null,"IOMAF",6,null,"PTP",0.15384615384615385,null,"PS",{"$f":"I8/15","v":{"$error":"#REF!"}},null,"CDU",0,null,"CDU",{"$f":"O8/15","v":201.2},null,"PS",108.79166666666667,null,"BE",{"$f":"U8/15","v":49.733333333333334},null,"CDS/PP",57.384615384615387,null,"PPD/PSD",{"$f":"AA8/15","v":192.6},null,"PPD/PSD",97.470588235294116,null,"PTP",{"$f":"AG8/15","v":10.933333333333334},null,"PPD/PSD",36.64,null,"IOMAF",{"$f":"AM8/15","v":23.733333333333334},null,"PPD/PSD",25.428571428571427]
[null,"PCTP/MRPP",{"$f":"C7/13","v":228.23076923076923},null,"CDU",null,null,"CDU",{"$f":"I9/15","v":{"$error":"#REF!"}},null,"BE",0,null,"BE",{"$f":"O9/15","v":30.333333333333332},null,"BE",106.75,null,"IOMAF",{"$f":"U9/15","v":53},null,"CDS/PP",56.785714285714285,null,"CDU",{"$f":"AA9/15","v":31.8},null,"CDU",95.4,null,"IOMAF",{"$f":"AG9/15","v":18.333333333333332},null,"MMS",36.391304347826086,null,"CDS/PP",{"$f":"AM9/15","v":66.666666666666671},null,"PS",24.714285714285715]
[null,"BE",8.1538461538461533,null,"PS",null,null,"BE",{"$f":"I10/15","v":{"$error":"#REF!"}},null,"PAN",0,null,"IOMAF",{"$f":"O10/15","v":174.06666666666666},null,"CDU",105.30434782608695,null,"CDS/PP",{"$f":"U10/15","v":21.333333333333332},null,"CDU",53.333333333333336,null,"BE",{"$f":"AA10/15","v":110.46666666666667},null,"PPD/PSD",93.5,null,"CDS/PP",{"$f":"AG10/15","v":102.26666666666667},null,"IOMAF",35.230769230769234,null,"PS",{"$f":"AM10/15","v":67.733333333333334},null,"IOMAF",24.6]
[null,"CDS/PP",19.615384615384617,null,"PPD/PSD",null,null,"PAN",{"$f":"I11/15","v":{"$error":"#REF!"}},null,"PPD/PSD",0,null,"CDS/PP",{"$f":"O11/15","v":161.46666666666667},null,"CDS/PP",104.44,null,"PS",{"$f":"U11/15","v":115.33333333333333},null,"IOMAF",53.285714285714285,null,"IOMAF",{"$f":"AA11/15","v":62.333333333333336},null,"PS",92.055555555555557,null,"PS",{"$f":"AG11/15","v":55.8},null,"PS",34.875,null,"PPD/PSD",{"$f":"AM11/15","v":8.1999999999999993},null,"IOMAF",23.733333333333334]
[null,"PAN",15.076923076923077,null,"PTP",null,null,"PPD/PSD",{"$f":"I7/16","v":{"$error":"#REF!"}},null,"IOMAF",0,null,"PS",{"$f":"O7/16","v":53.375},null,"PPD/PSD",100.91666666666667,null,"PPD/PSD",{"$f":"U7/16","v":122.125},null,"IOMAF",53,null,"CDS/PP",{"$f":"AA7/16","v":237.5},null,"CDS/PP",87.21052631578948,null,"PPD/PSD",{"$f":"AG7/16","v":57.25},null,"CDS/PP",34.375,null,"CDU",{"$f":"AM7/16","v":21.625},null,"PAN",23.066666666666666]
[null,"PS",350.30769230769232,null,"IOMAF",null,null,"CDU",{"$f":"I8/16","v":{"$error":"#REF!"}},null,"CDS/PP",0,null,"PPD/PSD",{"$f":"O8/16","v":188.625},null,"IOMAF",100.42307692307692,null,"CDU",{"$f":"U8/16","v":46.625},null,"BE",49.733333333333334,null,"PS",{"$f":"AA8/16","v":180.5625},null,"PS",85,null,"CDU",{"$f":"AG8/16","v":10.25},null,"BE",33.925925925925924,null,"BE",{"$f":"AM8/16","v":22.25},null,"BE",22.25]
[null,"PPD/PSD",5.5384615384615383,null,"PCTP/MRPP",null,null,"BE",{"$f":"I9/16","v":{"$error":"#REF!"}},null,"PS",0,null,"CDU",{"$f":"O9/16","v":28.4375},null,"PS",96.88,null,"BE",{"$f":"U9/16","v":49.6875},null,"BE",49.6875,null,"PPD/PSD",{"$f":"AA9/16","v":29.8125},null,"IOMAF",82.85,null,"BE",{"$f":"AG9/16","v":17.1875},null,"PAN",33.479999999999997,null,"MMS",{"$f":"AM9/16","v":62.5},null,"CDU",21.625]
[null,"PTP",{"$f":"C7/13","v":228.23076923076923},null,"CDU",null,null,"PAN",{"$f":"I10/16","v":{"$error":"#REF!"}},null,"CDU",0,null,"BE",{"$f":"O10/16","v":163.1875},null,"CDU",94.888888888888886,null,"IOMAF",{"$f":"U10/16","v":20},null,"CDU",46.764705882352942,null,"CDU",{"$f":"AA10/16","v":103.5625},null,"PPD/PSD",79.5,null,"MMS",{"$f":"AG10/16","v":95.875},null,"PPD/PSD",32.799999999999997,null,"PAN",{"$f":"AM10/16","v":63.5},null,"PS",20.941176470588236]
[null,"IOMAF",{"$f":"C8/14","v":7.5714285714285712},null,"PS",null,null,"PPD/PSD",{"$f":"I11/16","v":{"$error":"#REF!"}},null,"BE",0,null,"IOMAF",{"$f":"O11/16","v":151.375},null,"CDS/PP",93.15384615384616,null,"CDS/PP",{"$f":"U11/16","v":108.125},null,"CDU",46.625,null,"BE",{"$f":"AA11/16","v":58.4375},null,"PPD/PSD",78.904761904761898,null,"PAN",{"$f":"AG11/16","v":52.3125},null,"CDU",32.192307692307693,null,"IOMAF",{"$f":"AM11/16","v":7.6875},null,"BE",20.5]
[null,"PCTP/MRPP",{"$f":"C9/14","v":18.214285714285715},null,"PPD/PSD",null,null,"IOMAF",{"$f":"I7/17","v":{"$error":"#REF!"}},null,"PAN",0,null,"CDS/PP",{"$f":"O7/17","v":50.235294117647058},null,"CDU",91,null,"PS",{"$f":"U7/17","v":114.94117647058823},null,"PPD/PSD",45.714285714285715,null,"IOMAF",{"$f":"AA7/17","v":223.52941176470588},null,"CDS/PP",77.916666666666671,null,"PTP",{"$f":"AG7/17","v":53.882352941176471},null,"MMS",30.555555555555557,null,"CDS/PP",{"$f":"AM7/17","v":20.352941176470587},null,"CDS/PP",20.352941176470587]
[null,"BE",{"$f":"C10/14","v":14},null,"PTP",null,null,"CDS/PP",{"$f":"I8/17","v":{"$error":"#REF!"}},null,"PPD/PSD",0,null,"PS",{"$f":"O8/17","v":177.52941176470588},null,"PPD/PSD",85.4,null,"PPD/PSD",{"$f":"U8/17","v":43.882352941176471},null,"PPD/PSD",44.166666666666664,null,"CDS/PP",{"$f":"AA8/17","v":169.94117647058823},null,"PS",75.318181818181813,null,"IOMAF",{"$f":"AG8/17","v":9.6470588235294112},null,"PS",27.5,null,"PS",{"$f":"AM8/17","v":20.941176470588236},null,"PAN",19.777777777777779]
[null,"CDS/PP",{"$f":"C11/14","v":325.28571428571428},null,"IOMAF",null,null,"PS",{"$f":"I9/17","v":{"$error":"#REF!"}},null,"IOMAF",0,null,"PPD/PSD",{"$f":"O9/17","v":26.764705882352942},null,"PS",77.63636363636364,null,"CDU",{"$f":"U9/17","v":46.764705882352942},null,"PPD/PSD",43.882352941176471,null,"PS",{"$f":"AA9/17","v":28.058823529411764},null,"CDS/PP",72.043478260869563,null,"CDS/PP",{"$f":"AG9/17","v":16.176470588235293},null,"PTP",27.333333333333332,null,"PPD/PSD",{"$f":"AM9/17","v":58.823529411764703},null,"MMS",19.222222222222221]
[null,"PAN",{"$f":"C12/14","v":5.1428571428571432},null,"PCTP/MRPP",null,null,"CDU",{"$f":"I10/17","v":{"$error":"#REF!"}},null,"CDS/PP",0,null,"CDU",{"$f":"O10/17","v":153.58823529411765},null,"PPD/PSD",75.833333333333329,null,"BE",{"$f":"U10/17","v":18.823529411764707},null,"PS",41.842105263157897,null,"PPD/PSD",{"$f":"AA10/17","v":97.470588235294116},null,"IOMAF",71.92307692307692,null,"PS",{"$f":"AG10/17","v":90.235294117647058},null,"PAN",25,null,"CDU",{"$f":"AM10/17","v":59.764705882352942},null,"CDU",18.736842105263158]
[null,"CDU",null,null,"CDU",null,null,"BE",{"$f":"I11/17","v":{"$error":"#REF!"}},null,"PS",0,null,"BE",{"$f":"O11/17","v":142.47058823529412},null,"IOMAF",71.166666666666671,null,"IOMAF",{"$f":"U11/17","v":101.76470588235294},null,"PS",41.444444444444443,null,"CDU",{"$f":"AA11/17","v":55},null,"IOMAF",69.041666666666671,null,"PPD/PSD",{"$f":"AG11/17","v":49.235294117647058},null,"CDU",23.428571428571427,null,"BE",{"$f":"AM11/17","v":7.2352941176470589},null,"PPD/PSD",18.210526315789473]
[null,"PS",null,null,"PS",null,null,"PAN",{"$f":"I7/18","v":{"$error":"#REF!"}},null,"CDU",0,null,"IOMAF",{"$f":"O7/18","v":47.444444444444443},null,"BE",65.692307692307693,null,"CDS/PP",{"$f":"U7/18","v":108.55555555555556},null,"PS",40,null,"BE",{"$f":"AA7/18","v":211.11111111111111},null,"PS",68.142857142857139,null,"CDU",{"$f":"AG7/18","v":50.888888888888886},null,"PPD/PSD",22.916666666666668,null,"MMS",{"$f":"AM7/18","v":19.222222222222221},null,"CDS/PP",17.8]
[null,"PPD/PSD",null,null,"PPD/PSD",null,null,"PPD/PSD",{"$f":"I8/18","v":{"$error":"#REF!"}},null,"BE",0,null,"CDS/PP",{"$f":"O8/18","v":167.66666666666666},null,"PS",65,null,"PS",{"$f":"U8/18","v":41.444444444444443},null,"CDS/PP",39.75,null,"IOMAF",{"$f":"AA8/18","v":160.5},null,"CDS/PP",66.785714285714292,null,"BE",{"$f":"AG8/18","v":9.1111111111111107},null,"PTP",21.153846153846153,null,"PAN",{"$f":"AM8/18","v":19.777777777777779},null,"PS",17.571428571428573]
[null,"PTP",null,null,"PTP",null,null,"IOMAF",{"$f":"I9/18","v":{"$error":"#REF!"}},null,"PAN",0,null,"PS",{"$f":"O9/18","v":25.277777777777779},null,"CDU",61,null,"PPD/PSD",{"$f":"U9/18","v":44.166666666666664},null,"CDS/PP",39.263157894736842,null,"CDS/PP",{"$f":"AA9/18","v":26.5},null,"BE",66.28,null,"MMS",{"$f":"AG9/18","v":15.277777777777779},null,"IOMAF",20.5,null,"IOMAF",{"$f":"AM9/18","v":55.555555555555557},null,"IOMAF",17.3]
[null,"IOMAF",null,null,"IOMAF",null,null,"CDS/PP",{"$f":"I10/18","v":{"$error":"#REF!"}},null,"PPD/PSD",0,null,"PPD/PSD",{"$f":"O10/18","v":145.05555555555554},null,"PPD/PSD",56.93333333333333,null,"CDU",{"$f":"U10/18","v":17.777777777777779},null,"IOMAF",37.857142857142854,null,"PS",{"$f":"AA10/18","v":92.055555555555557},null,"PS",63.730769230769234,null,"PAN",{"$f":"AG10/18","v":85.222222222222229},null,"CDU",19.642857142857142,null,"CDS/PP",{"$f":"AM10/18","v":56.444444444444443},null,"MMS",16.952380952380953]
[null,"PCTP/MRPP",null,null,"PCTP/MRPP",null,null,"PS",{"$f":"I11/18","v":{"$error":"#REF!"}},null,"IOMAF",0,null,"CDU",{"$f":"O11/18","v":134.55555555555554},null,"CDS/PP",56.875,null,"BE",{"$f":"U11/18","v":96.111111111111114},null,"IOMAF",37.299999999999997,null,"PPD/PSD",{"$f":"AA11/18","v":51.944444444444443},null,"IOMAF",62.333333333333336,null,"PTP",{"$f":"AG11/18","v":46.5},null,"IOMAF",18.333333333333332,null,"PS",{"$f":"AM11/18","v":6.833333333333333},null,"BE",16.476190476190474]
[null,null,null,null,"CDU",null,null,"CDU",{"$f":"I7/19","v":{"$error":"#REF!"}},null,"CDS/PP",0,null,"BE",{"$f":"O7/19","v":44.94736842105263},null,"PS",53.375,null,"IOMAF",{"$f":"U7/19","v":102.84210526315789},null,"BE",36.136363636363633,null,"CDU",{"$f":"AA7/19","v":200},null,"PPD/PSD",59.625,null,"IOMAF",{"$f":"AG7/19","v":48.210526315789473},null,"BE",18.222222222222221,null,"PPD/PSD",{"$f":"AM7/19","v":18.210526315789473},null,"PPD/PSD",16.181818181818183]
[null,null,null,null,"PS",null,null,"BE",{"$f":"I8/19","v":{"$error":"#REF!"}},null,"PS",0,null,"IOMAF",{"$f":"O8/19","v":158.84210526315789},null,"IOMAF",50.555555555555557,null,"CDS/PP",{"$f":"U8/19","v":39.263157894736842},null,"CDS/PP",35.555555555555557,null,"BE",{"$f":"AA8/19","v":152.05263157894737},null,"BE",58.4375,null,"CDS/PP",{"$f":"AG8/19","v":8.6315789473684212},null,"BE",17.1875,null,"CDU",{"$f":"AM8/19","v":18.736842105263158},null,"PS",15.727272727272727]
[null,null,null,null,"PPD/PSD",null,null,"PAN",{"$f":"I9/19","v":{"$error":"#REF!"}},null,"CDU",0,null,"CDS/PP",{"$f":"O9/19","v":23.94736842105263},null,"CDS/PP",50.235294117647058,null,"PS",{"$f":"U9/19","v":41.842105263157897},null,"BE",35.523809523809526,null,"IOMAF",{"$f":"AA9/19","v":25.105263157894736},null,"CDU",55,null,"PS",{"$f":"AG9/19","v":14.473684210526315},null,"CDS/PP",16.399999999999999,null,"BE",{"$f":"AM9/19","v":52.631578947368418},null,"IOMAF",15.478260869565217]
[null,null,null,null,"PTP",null,null,"PPD/PSD",{"$f":"I10/19","v":{"$error":"#REF!"}},null,"CDU",0,null,"PS",{"$f":"O10/19","v":137.42105263157896},null,"IOMAF",47.444444444444443,null,"PPD/PSD",{"$f":"U10/19","v":16.842105263157894},null,"CDU",34.565217391304351,null,"CDS/PP",{"$f":"AA10/19","v":87.21052631578948},null,"PS",53,null,"PPD/PSD",{"$f":"AG10/19","v":80.736842105263165},null,"CDS/PP",16.176470588235293,null,"MMS",{"$f":"AM10/19","v":53.473684210526315},null,"PAN",15.375]
[null,null,null,null,"IOMAF",null,null,"IOMAF",{"$f":"I11/19","v":{"$error":"#REF!"}},null,"BE",0,null,"PPD/PSD",{"$f":"O11/19","v":127.47368421052632},null,"BE",45.5,null,"CDU",{"$f":"U11/19","v":91.05263157894737},null,"CDU",33.909090909090907,null,"PS",{"$f":"AA11/19","v":49.210526315789473},null,"PPD/PSD",51.944444444444443,null,"CDU",{"$f":"AG11/19","v":44.05263157894737},null,"MMS",15.277777777777779,null,"PAN",{"$f":"AM11/19","v":6.4736842105263159},null,"PAN",15.043478260869565]
[null,null,null,null,"PCTP/MRPP",null,null,"CDS/PP",{"$f":"I7/20","v":{"$error":"#REF!"}},null,"PAN",0,null,"CDU",{"$f":"O7/20","v":42.7},null,"BE",44.94736842105263,null,"BE",{"$f":"U7/20","v":97.7},null,"PPD/PSD",33.125,null,"PPD/PSD",{"$f":"AA7/20","v":190},null,"PS",49.210526315789473,null,"BE",{"$f":"AG7/20","v":45.8},null,"MMS",14.909090909090908,null,"IOMAF",{"$f":"AM7/20","v":17.3},null,"BE",14.833333333333334]
[null,null,null,null,null,null,null,"PS",{"$f":"I8/20","v":{"$error":"#REF!"}},null,"PPD/PSD",0,null,"BE",{"$f":"O8/20","v":150.9},null,"CDU",42.7,null,"IOMAF",{"$f":"U8/20","v":37.299999999999997},null,"PPD/PSD",32.434782608695649,null,"CDU",{"$f":"AA8/20","v":144.44999999999999},null,"CDS/PP",47.7,null,"MMS",{"$f":"AG8/20","v":8.1999999999999993},null,"PS",14.473684210526315,null,"CDS/PP",{"$f":"AM8/20","v":17.8},null,"CDU",14.416666666666666]
[null,null,null,null,null,null,null,"CDU",{"$f":"I9/20","v":{"$error":"#REF!"}},null,"IOMAF",0,null,"IOMAF",{"$f":"O9/20","v":22.75},null,"CDU",41.363636363636367,null,"CDS/PP",{"$f":"U9/20","v":39.75},null,"IOMAF",32,null,"BE",{"$f":"AA9/20","v":23.85},null,"CDS/PP",46.75,null,"PAN",{"$f":"AG9/20","v":13.75},null,"PAN",13.75,null,"PS",{"$f":"AM9/20","v":50},null,"PS",14.24]
[null,null,null,null,null,null,null,"BE",{"$f":"I10/20","v":{"$error":"#REF!"}},null,"CDS/PP",0,null,"CDS/PP",{"$f":"O10/20","v":130.55000000000001},null,"PPD/PSD",40.666666666666664,null,"PS",{"$f":"U10/20","v":16},null,"PS",31.8,null,"IOMAF",{"$f":"AA10/20","v":82.85},null,"CDU",44.523809523809526,null,"PTP",{"$f":"AG10/20","v":76.7},null,"PS",13.666666666666666,null,"PPD/PSD",{"$f":"AM10/20","v":50.8},null,"CDS/PP",13.84]
[null,null,null,null,null,null,null,"PAN",{"$f":"I11/20","v":{"$error":"#REF!"}},null,"PS",0,null,"PS",{"$f":"O11/20","v":121.1},null,"PS",38.81818181818182,null,"PPD/PSD",{"$f":"U11/20","v":86.5},null,"PS",31.083333333333332,null,"CDS/PP",{"$f":"AA11/20","v":46.75},null,"IOMAF",43.363636363636367,null,"IOMAF",{"$f":"AG11/20","v":41.85},null,"PPD/PSD",13.095238095238095,null,"CDU",{"$f":"AM11/20","v":6.15},null,"IOMAF",13.692307692307692]
[null,null,null,null,null,null,null,"PPD/PSD",{"$f":"I7/21","v":{"$error":"#REF!"}},null,"CDU",0,null,"PPD/PSD",{"$f":"O7/21","v":40.666666666666664},null,"PS",37.916666666666664,null,"CDU",{"$f":"U7/21","v":93.047619047619051},null,"CDS/PP",30.576923076923077,null,"IOMAF",{"$f":"AA7/21","v":180.95238095238096},null,"PPD/PSD",42.5,null,"CDS/PP",{"$f":"AG7/21","v":43.61904761904762},null,"PAN",12.615384615384615,null,"BE",{"$f":"AM7/21","v":16.476190476190474},null,"CDU",13.666666666666666]
[null,null,null,null,null,null,null,"IOMAF",{"$f":"I8/21","v":{"$error":"#REF!"}},null,"BE",0,null,"CDU",{"$f":"O8/21","v":143.71428571428572},null,"IOMAF",37.130434782608695,null,"BE",{"$f":"U8/21","v":35.523809523809526},null,"CDS/PP",29.84,null,"CDS/PP",{"$f":"AA8/21","v":137.57142857142858},null,"PS",40.652173913043477,null,"PS",{"$f":"AG8/21","v":7.8095238095238093},null,"PTP",12.5,null,"MMS",{"$f":"AM8/21","v":16.952380952380953},null,"MMS",13.307692307692308]
[null,null,null,null,null,null,null,"CDS/PP",{"$f":"I9/21","v":{"$error":"#REF!"}},null,"PAN",0,null,"BE",{"$f":"O9/21","v":21.666666666666668},null,"BE",35.583333333333336,null,"IOMAF",{"$f":"U9/21","v":37.857142857142854},null,"IOMAF",29.444444444444443,null,"PS",{"$f":"AA9/21","v":22.714285714285715},null,"BE",39.75,null,"PPD/PSD",{"$f":"AG9/21","v":13.095238095238095},null,"CDU",11.956521739130435,null,"PAN",{"$f":"AM9/21","v":47.61904761904762},null,"CDS/PP",13.185185185185185]
[null,null,null,null,null,null,null,"PS",{"$f":"I10/21","v":{"$error":"#REF!"}},null,"PPD/PSD",0,null,"IOMAF",{"$f":"O10/21","v":124.33333333333333},null,"CDS/PP",35,null,"CDS/PP",{"$f":"U10/21","v":15.238095238095237},null,"BE",29.09090909090909,null,"PPD/PSD",{"$f":"AA10/21","v":78.904761904761898},null,"CDS/PP",38.958333333333336,null,"CDU",{"$f":"AG10/21","v":73.047619047619051},null,"PPD/PSD",11.714285714285714,null,"IOMAF",{"$f":"AM10/21","v":48.38095238095238},null,"IOMAF",12.814814814814815]
[null,null,null,null,null,null,null,"CDU",{"$f":"I11/21","v":{"$error":"#REF!"}},null,"CDU",0,null,"CDS/PP",{"$f":"O11/21","v":115.33333333333333},null,"CDU",34.159999999999997,null,"PS",{"$f":"U11/21","v":82.38095238095238},null,"IOMAF",28.692307692307693,null,"CDU",{"$f":"AA11/21","v":44.523809523809526},null,"IOMAF",37.4,null,"BE",{"$f":"AG11/21","v":39.857142857142854},null,"IOMAF",11.458333333333334,null,"CDS/PP",{"$f":"AM11/21","v":5.8571428571428568},null,"CDS/PP",12.3]
[null,null,null,null,null,null,null,"CDU",{"$f":"I7/22","v":{"$error":"#REF!"}},null,"BE",0,null,"PS",{"$f":"O7/22","v":38.81818181818182},null,"PPD/PSD",32.846153846153847,null,"PPD/PSD",{"$f":"U7/22","v":88.818181818181813},null,"BE",27.62962962962963,null,"BE",{"$f":"AA7/22","v":172.72727272727272},null,"CDU",36.692307692307693,null,"MMS",{"$f":"AG7/22","v":41.636363636363633},null,"BE",11,null,"PS",{"$f":"AM7/22","v":15.727272727272727},null,"MMS",11.181818181818182]
[null,null,null,null,null,null,null,"BE",{"$f":"I8/22","v":{"$error":"#REF!"}},null,"PAN",0,null,"PPD/PSD",{"$f":"O8/22","v":137.18181818181819},null,"IOMAF",32.5,null,"CDU",{"$f":"U8/22","v":33.909090909090907},null,"CDU",26.666666666666668,null,"IOMAF",{"$f":"AA8/22","v":131.31818181818181},null,"PPD/PSD",35.96153846153846,null,"PAN",{"$f":"AG8/22","v":7.4545454545454541},null,"PTP",10.933333333333334,null,"PPD/PSD",{"$f":"AM8/22","v":16.181818181818183},null,"PPD/PSD",10.25]
[null,null,null,null,null,null,null,"PAN",{"$f":"I9/22","v":{"$error":"#REF!"}},null,"PPD/PSD",0,null,"CDU",{"$f":"O9/22","v":20.681818181818183},null,"PS",31.62962962962963,null,"BE",{"$f":"U9/22","v":36.136363636363633},null,"PPD/PSD",24.615384615384617,null,"CDS/PP",{"$f":"AA9/22","v":21.681818181818183},null,"PPD/PSD",34.071428571428569,null,"PTP",{"$f":"AG9/22","v":12.5},null,"PS",10.576923076923077,null,"CDU",{"$f":"AM9/22","v":45.454545454545453},null,"CDS/PP",9.4615384615384617]
[null,null,null,null,null,null,null,"PPD/PSD",{"$f":"I10/22","v":{"$error":"#REF!"}},null,"IOMAF",0,null,"BE",{"$f":"O10/22","v":118.68181818181819},null,"BE",30.333333333333332,null,"IOMAF",{"$f":"U10/22","v":14.545454545454545},null,"PS",22.857142857142858,null,"PS",{"$f":"AA10/22","v":75.318181818181813},null,"CDU",31.8,null,"IOMAF",{"$f":"AG10/22","v":69.727272727272734},null,"CDU",10.25,null,"BE",{"$f":"AM10/22","v":46.18181818181818},null,"MMS",8.7857142857142865]
[null,null,null,null,null,null,null,"IOMAF",{"$f":"I11/22","v":{"$error":"#REF!"}},null,"CDS/PP",0,null,"IOMAF",{"$f":"O11/22","v":110.09090909090909},null,"CDU",28.4375,null,"CDS/PP",{"$f":"U11/22","v":78.63636363636364},null,"CDS/PP",21.333333333333332,null,"PPD/PSD",{"$f":"AA11/22","v":42.5},null,"PPD/PSD",29.8125,null,"CDS/PP",{"$f":"AG11/22","v":38.045454545454547},null,"PAN",10.185185185185185,null,"MMS",{"$f":"AM11/22","v":5.5909090909090908},null,"PPD/PSD",8.1999999999999993]
[null,null,null,null,null,null,null,"CDS/PP",{"$f":"I7/23","v":{"$error":"#REF!"}},null,"PS",0,null,"IOMAF",{"$f":"O7/23","v":37.130434782608695},null,"PPD/PSD",26.764705882352942,null,"PS",{"$f":"U7/23","v":84.956521739130437},null,"IOMAF",20,null,"CDU",{"$f":"AA7/23","v":165.21739130434781},null,"PS",28.058823529411764,null,"PS",{"$f":"AG7/23","v":39.826086956521742},null,"IOMAF",9.6470588235294112,null,"PAN",{"$f":"AM7/23","v":15.043478260869565},null,"IOMAF",7.6875]
[null,null,null,null,null,null,null,"PS",{"$f":"I8/23","v":{"$error":"#REF!"}},null,"CDU",0,null,"CDS/PP",{"$f":"O8/23","v":131.21739130434781},null,"PS",25.277777777777779,null,"PPD/PSD",{"$f":"U8/23","v":32.434782608695649},null,"BE",18.823529411764707,null,"BE",{"$f":"AA8/23","v":125.60869565217391},null,"CDS/PP",26.5,null,"PPD/PSD",{"$f":"AG8/23","v":7.1304347826086953},null,"BE",9.1111111111111107,null,"IOMAF",{"$f":"AM8/23","v":15.478260869565217},null,"BE",7.2352941176470589]
[null,null,null,null,null,null,null,"CDU",{"$f":"I9/23","v":{"$error":"#REF!"}},null,"BE",0,null,"PS",{"$f":"O9/23","v":19.782608695652176},null,"CDS/PP",23.94736842105263,null,"CDU",{"$f":"U9/23","v":34.565217391304351},null,"CDU",17.777777777777779,null,"IOMAF",{"$f":"AA9/23","v":20.739130434782609},null,"IOMAF",25.105263157894736,null,"CDU",{"$f":"AG9/23","v":11.956521739130435},null,"CDS/PP",8.6315789473684212,null,"CDS/PP",{"$f":"AM9/23","v":43.478260869565219},null,"PS",6.833333333333333]
[null,null,null,null,null,null,null,"BE",{"$f":"I10/23","v":{"$error":"#REF!"}},null,"PAN",0,null,"PPD/PSD",{"$f":"O10/23","v":113.52173913043478},null,"IOMAF",22.75,null,"BE",{"$f":"U10/23","v":13.913043478260869},null,"PPD/PSD",16.842105263157894,null,"CDS/PP",{"$f":"AA10/23","v":72.043478260869563},null,"BE",23.85,null,"BE",{"$f":"AG10/23","v":66.695652173913047},null,"MMS",8.1999999999999993,null,"PS",{"$f":"AM10/23","v":44.173913043478258},null,"PAN",6.4736842105263159]
[null,null,null,null,null,null,null,"PAN",{"$f":"I11/23","v":{"$error":"#REF!"}},null,"PPD/PSD",0,null,"CDU",{"$f":"O11/23","v":105.30434782608695},null,"BE",21.666666666666668,null,"IOMAF",{"$f":"U11/23","v":75.217391304347828},null,"PS",16,null,"PS",{"$f":"AA11/23","v":40.652173913043477},null,"PS",22.714285714285715,null,"MMS",{"$f":"AG11/23","v":36.391304347826086},null,"PS",7.8095238095238093,null,"PPD/PSD",{"$f":"AM11/23","v":5.3478260869565215},null,"CDU",6.15]
[null,null,null,null,null,null,null,"PPD/PSD",{"$f":"I7/24","v":{"$error":"#REF!"}},null,"IOMAF",0,null,"BE",{"$f":"O7/24","v":35.583333333333336},null,"CDU",20.681818181818183,null,"CDS/PP",{"$f":"U7/24","v":81.416666666666671},null,"CDS/PP",15.238095238095237,null,"PPD/PSD",{"$f":"AA7/24","v":158.33333333333334},null,"CDS/PP",21.681818181818183,null,"PAN",{"$f":"AG7/24","v":38.166666666666664},null,"PAN",7.4545454545454541,null,"CDU",{"$f":"AM7/24","v":14.416666666666666},null,"CDS/PP",5.8571428571428568]
[null,null,null,null,null,null,null,"CDU",{"$f":"I8/24","v":{"$error":"#REF!"}},null,"CDS/PP",0,null,"IOMAF",{"$f":"O8/24","v":125.75},null,"PS",19.782608695652176,null,"PS",{"$f":"U8/24","v":31.083333333333332},null,"IOMAF",14.545454545454545,null,"CDU",{"$f":"AA8/24","v":120.375},null,"IOMAF",20.739130434782609,null,"PTP",{"$f":"AG8/24","v":6.833333333333333},null,"PPD/PSD",7.1304347826086953,null,"BE",{"$f":"AM8/24","v":14.833333333333334},null,"MMS",5.5909090909090908]
[null,null,null,null,null,null,null,"BE",{"$f":"I9/24","v":{"$error":"#REF!"}},null,"PS",0,null,"CDS/PP",{"$f":"O9/24","v":18.958333333333332},null,"CDS/PP",18.958333333333332,null,"PPD/PSD",{"$f":"U9/24","v":33.125},null,"BE",13.913043478260869,null,"BE",{"$f":"AA9/24","v":19.875},null,"BE",19.875,null,"IOMAF",{"$f":"AG9/24","v":11.458333333333334},null,"PTP",6.833333333333333,null,"MMS",{"$f":"AM9/24","v":41.666666666666664},null,"PPD/PSD",5.3478260869565215]
[null,null,null,null,null,null,null,"PAN",{"$f":"I10/24","v":{"$error":"#REF!"}},null,"CDU",0,null,"PS",{"$f":"O10/24","v":108.79166666666667},null,"IOMAF",18.2,null,"CDU",{"$f":"U10/24","v":13.333333333333334},null,"CDU",13.333333333333334,null,"IOMAF",{"$f":"AA10/24","v":69.041666666666671},null,"CDU",19.079999999999998,null,"CDS/PP",{"$f":"AG10/24","v":63.916666666666664},null,"CDU",6.56,null,"PAN",{"$f":"AM10/24","v":42.333333333333336},null,"IOMAF",5.125]
[null,null,null,null,null,null,null,"PPD/PSD",{"$f":"I11/24","v":{"$error":"#REF!"}},null,"BE",0,null,"PPD/PSD",{"$f":"O11/24","v":100.91666666666667},null,"BE",17.5,null,"BE",{"$f":"U11/24","v":72.083333333333329},null,"PPD/PSD",12.8,null,"CDS/PP",{"$f":"AA11/24","v":38.958333333333336},null,"CDS/PP",18.346153846153847,null,"PS",{"$f":"AG11/24","v":34.875},null,"CDS/PP",6.3076923076923075,null,"IOMAF",{"$f":"AM11/24","v":5.125},null,"BE",4.92]
[null,null,null,null,null,null,null,"IOMAF",{"$f":"I7/25","v":{"$error":"#REF!"}},null,"PAN",0,null,"CDU",{"$f":"O7/25","v":34.159999999999997},null,"CDU",16.851851851851851,null,"IOMAF",{"$f":"U7/25","v":78.16},null,"PS",12.307692307692308,null,"PS",{"$f":"AA7/25","v":152},null,"IOMAF",17.666666666666668,null,"PPD/PSD",{"$f":"AG7/25","v":36.64},null,"MMS",6.0740740740740744,null,"CDS/PP",{"$f":"AM7/25","v":13.84},null,"PPD/PSD",4.7307692307692308]
[null,null,null,null,null,null,null,"CDS/PP",{"$f":"I8/25","v":{"$error":"#REF!"}},null,"PPD/PSD",0,null,"BE",{"$f":"O8/25","v":120.72},null,"BE",96.703703703703709,null,"CDS/PP",{"$f":"U8/25","v":29.84},null,"CDS/PP",11.851851851851851,null,"PPD/PSD",{"$f":"AA8/25","v":115.56},null,"CDS/PP",61.370370370370374,null,"CDU",{"$f":"AG8/25","v":6.56},null,"PTP",56.814814814814817,null,"PS",{"$f":"AM8/25","v":14.24},null,"PPD/PSD",37.629629629629626]
[null,null,null,null,null,null,null,"PS",{"$f":"I9/25","v":{"$error":"#REF!"}},null,"IOMAF",0,null,"IOMAF",{"$f":"O9/25","v":18.2},null,"IOMAF",89.703703703703709,null,"PS",{"$f":"U9/25","v":31.8},null,"PS",64.074074074074076,null,"CDU",{"$f":"AA9/25","v":19.079999999999998},null,"PS",34.629629629629626,null,"BE",{"$f":"AG9/25","v":11},null,"IOMAF",31,null,"PPD/PSD",{"$f":"AM9/25","v":40},null,"CDU",4.5555555555555554]
[null,null,null,null,null,null,null,"CDU",{"$f":"I10/25","v":{"$error":"#REF!"}},null,"CDS/PP",0,null,"CDS/PP",{"$f":"O10/25","v":104.44},null,"CDS/PP",null,null,"PPD/PSD",{"$f":"U10/25","v":12.8},null,"PPD/PSD",null,null,"BE",{"$f":"AA10/25","v":66.28},null,"PPD/PSD",null,null,"MMS",{"$f":"AG10/25","v":61.36},null,"CDS/PP",null,null,"CDU",{"$f":"AM10/25","v":40.64},null,"BE"]
[null,null,null,null,null,null,null,"BE",{"$f":"I11/25","v":{"$error":"#REF!"}},null,"PS",0,null,"PS",{"$f":"O11/25","v":96.88},null,"PS",null,null,"CDU",{"$f":"U11/25","v":69.2},null,"CDU",null,null,"IOMAF",{"$f":"AA11/25","v":37.4},null,"CDU",null,null,"PAN",{"$f":"AG11/25","v":33.479999999999997},null,"PS",null,null,"BE",{"$f":"AM11/25","v":4.92},null,"MMS"]
[null,null,null,null,null,null,null,"PAN",{"$f":"I7/26","v":{"$error":"#REF!"}},null,"CDU",0,null,"PPD/PSD",{"$f":"O7/26","v":32.846153846153847},null,"PPD/PSD",null,null,"BE",{"$f":"U7/26","v":75.15384615384616},null,"BE",null,null,"CDS/PP",{"$f":"AA7/26","v":146.15384615384616},null,"BE",null,null,"IOMAF",{"$f":"AG7/26","v":35.230769230769234},null,"PPD/PSD",null,null,"MMS",{"$f":"AM7/26","v":13.307692307692308}]
[null,null,null,null,null,null,null,"PPD/PSD",{"$f":"I8/26","v":{"$error":"#REF!"}},null,"BE",0,null,"CDU",{"$f":"O8/26","v":116.07692307692308},null,"CDU",null,null,"IOMAF",{"$f":"U8/26","v":28.692307692307693},null,"IOMAF",null,null,"IOMAF",{"$f":"AA8/26","v":111.11538461538461},null,"IOMAF",null,null,"CDS/PP",{"$f":"AG8/26","v":6.3076923076923075},null,null,null,null,"IOMAF",{"$f":"AM8/26","v":13.692307692307692}]
[null,null,null,null,null,null,null,"IOMAF",{"$f":"I9/26","v":{"$error":"#REF!"}},null,"PAN",0,null,"BE",{"$f":"O9/26","v":17.5},null,"BE",null,null,"CDS/PP",{"$f":"U9/26","v":30.576923076923077},null,"CDS/PP",null,null,"CDS/PP",{"$f":"AA9/26","v":18.346153846153847},null,"CDS/PP",null,null,"PS",{"$f":"AG9/26","v":10.576923076923077},null,null,null,null,"CDS/PP",{"$f":"AM9/26","v":38.46153846153846}]
[null,null,null,null,null,null,null,"CDS/PP",{"$f":"I10/26","v":{"$error":"#REF!"}},null,"PPD/PSD",0,null,"IOMAF",{"$f":"O10/26","v":100.42307692307692},null,"IOMAF",null,null,"PS",{"$f":"U10/26","v":12.307692307692308},null,"PS",null,null,"PS",{"$f":"AA10/26","v":63.730769230769234},null,"PS",null,null,"PPD/PSD",{"$f":"AG10/26","v":59},null,null,null,null,"PS",{"$f":"AM10/26","v":39.07692307692308}]
[null,null,null,null,null,null,null,"PS",{"$f":"I11/26","v":{"$error":"#REF!"}},null,"IOMAF",0,null,"CDS/PP",{"$f":"O11/26","v":93.15384615384616},null,"CDS/PP",null,null,"PPD/PSD",{"$f":"U11/26","v":66.538461538461533},null,"PPD/PSD",null,null,"PPD/PSD",{"$f":"AA11/26","v":35.96153846153846},null,"PPD/PSD",null,null,"CDU",{"$f":"AG11/26","v":32.192307692307693},null,null,null,null,"PPD/PSD",{"$f":"AM11/26","v":4.7307692307692308}]
[null,null,null,null,null,null,null,"CDU",{"$f":"I7/27","v":{"$error":"#REF!"}},null,"CDS/PP",0,null,"PS",{"$f":"O7/27","v":31.62962962962963},null,"PS",null,null,"CDU",{"$f":"U7/27","v":72.370370370370367},null,"CDU",null,null,"CDU",{"$f":"AA7/27","v":140.74074074074073},null,"CDU",null,null,"BE",{"$f":"AG7/27","v":33.925925925925924},null,null,null,null,"IOMAF",{"$f":"AM7/27","v":12.814814814814815}]
[null,null,null,null,null,null,null,"BE",{"$f":"I8/27","v":{"$error":"#REF!"}},null,"PS",0,null,"PPD/PSD",{"$f":"O8/27","v":111.77777777777777},null,"PPD/PSD",null,null,"BE",{"$f":"U8/27","v":27.62962962962963},null,"BE",null,null,"BE",{"$f":"AA8/27","v":107},null,"BE",null,null,"MMS",{"$f":"AG8/27","v":6.0740740740740744},null,null,null,null,"CDS/PP",{"$f":"AM8/27","v":13.185185185185185}]
[null,null,null,null,null,null,null,"PAN",{"$f":"I9/27","v":{"$error":"#REF!"}},null,"CDU",0,null,"CDU",{"$f":"O9/27","v":16.851851851851851},null,"CDU",null,null,"IOMAF",{"$f":"U9/27","v":29.444444444444443},null,"IOMAF",null,null,"IOMAF",{"$f":"AA9/27","v":17.666666666666668},null,null,null,null,"PAN",{"$f":"AG9/27","v":10.185185185185185},null,null,null,null,"PS",{"$f":"AM9/27","v":37.037037037037038}]
[null,null,null,null,null,null,null,"PPD/PSD",{"$f":"I10/27","v":{"$error":"#REF!"}},null,"CDU",0,null,"BE",{"$f":"O10/27","v":96.703703703703709},null,"BE",null,null,"CDS/PP",{"$f":"U10/27","v":11.851851851851851},null,"CDS/PP",null,null,"CDS/PP",{"$f":"AA10/27","v":61.370370370370374},null,null,null,null,"PTP",{"$f":"AG10/27","v":56.814814814814817},null,null,null,null,"PPD/PSD",{"$f":"AM10/27","v":37.629629629629626}]
[null,null,null,null,null,null,null,"IOMAF",{"$f":"I11/27","v":{"$error":"#REF!"}},null,"BE",0,null,"IOMAF",{"$f":"O11/27","v":89.703703703703709},null,"IOMAF",null,null,"PS",{"$f":"U11/27","v":64.074074074074076},null,"PS",null,null,"PS",{"$f":"AA11/27","v":34.629629629629626},null,null,null,null,"IOMAF",{"$f":"AG11/27","v":31},null,null,null,null,"CDU",{"$f":"AM11/27","v":4.5555555555555554}]
[null,null,null,null,null,null,null,"CDS/PP",{"$f":"I7/28","v":{"$error":"#REF!"}},null,"PAN",0,null,"CDS/PP",null,null,"CDS/PP",null,null,"PPD/PSD",null,null,"PPD/PSD",null,null,"PPD/PSD",null,null,null,null,null,"CDS/PP",null,null,null,null,null,"BE"]
[null,null,null,null,null,null,null,"PS",{"$f":"I8/28","v":{"$error":"#REF!"}},null,"PPD/PSD",0,null,"PS",null,null,"PS",null,null,"CDU",null,null,"CDU",null,null,"CDU",null,null,null,null,null,"PS",null,null,null,null,null,"MMS"]
[null,null,null,null,null,null,null,"CDU",{"$f":"I9/28","v":{"$error":"#REF!"}},null,"IOMAF",0,null,"PPD/PSD",null,null,"PPD/PSD",null,null,"BE",null,null,"BE",null,null,"BE",null,null,null,null,null,"PPD/PSD"]
[null,null,null,null,null,null,null,"BE",{"$f":"I10/28","v":{"$error":"#REF!"}},null,"CDS/PP",0,null,"CDU",null,null,"CDU",null,null,"IOMAF",null,null,"IOMAF",null,null,"IOMAF"]
[null,null,null,null,null,null,null,"PAN",{"$f":"I11/28","v":{"$error":"#REF!"}},null,"PS",0,null,"BE",null,null,"BE",null,null,"CDS/PP",null,null,"CDS/PP",null,null,"CDS/PP"]
[null,null,null,null,null,null,null,"PPD/PSD",{"$f":"I7/29","v":{"$error":"#REF!"}},null,"CDU",0,null,"IOMAF",null,null,"IOMAF",null,null,"PS",null,null,"PS",null,null,"PS"]
[null,null,null,null,null,null,null,"IOMAF",{"$f":"I8/29","v":{"$error":"#REF!"}},null,"BE",0,null,"CDS/PP",null,null,"CDS/PP",null,null,"PPD/PSD",null,null,"PPD/PSD",null,null,"PPD/PSD"]
[null,null,null,null,null,null,null,"CDS/PP",{"$f":"I9/29","v":{"$error":"#REF!"}},null,"PAN",0,null,"PS",null,null,"PS",null,null,"CDU",null,null,"CDU",null,null,"CDU"]
[null,null,null,null,null,null,null,"PS",{"$f":"I10/29","v":{"$error":"#REF!"}},null,"PPD/PSD",0,null,"PPD/PSD",null,null,"PPD/PSD",null,null,"BE",null,null,"BE",null,null,"BE"]
[null,null,null,null,null,null,null,"CDU",{"$f":"I11/29","v":{"$error":"#REF!"}},null,"IOMAF",0,null,"CDU",null,null,"CDU",null,null,"IOMAF",null,null,"IOMAF"]
[null,null,null,null,null,null,null,"CDU",{"$f":"I7/30","v":{"$error":"#REF!"}},null,"CDS/PP",0,null,"BE",null,null,"BE",null,null,"CDS/PP",null,null,"CDS/PP"]
[null,null,null,null,null,null,null,"BE",{"$f":"I8/30","v":{"$error":"#REF!"}},null,"PS",0,null,"IOMAF",null,null,"IOMAF",null,null,"PS",null,null,"PS"]
[null,null,null,null,null,null,null,"PAN",{"$f":"I9/30","v":{"$error":"#REF!"}},null,"CDU",0,null,"CDS/PP",null,null,"CDS/PP",null,null,"PPD/PSD",null,null,"PPD/PSD"]
[null,null,null,null,null,null,null,"PPD/PSD",{"$f":"I10/30","v":{"$error":"#REF!"}},null,"BE",0,null,"PS",null,null,"PS",null,null,"CDU",null,null,"CDU"]
[null,null,null,null,null,null,null,"IOMAF",{"$f":"I11/30","v":{"$error":"#REF!"}},null,"PAN",0,null,"PPD/PSD",null,null,"PPD/PSD",null,null,"BE",null,null,"BE"]
[null,null,null,null,null,null,null,"CDS/PP",{"$f":"I7/31","v":{"$error":"#REF!"}},null,"PPD/PSD",0,null,"CDU",null,null,"CDU",null,null,"IOMAF",null,null,"IOMAF"]
[null,null,null,null,null,null,null,"PS",{"$f":"I8/31","v":{"$error":"#REF!"}},null,"IOMAF",0,null,"BE",null,null,"BE",null,null,"CDS/PP",null,null,"CDS/PP"]
[null,null,null,null,null,null,null,"CDU",{"$f":"I9/31","v":{"$error":"#REF!"}},null,"CDS/PP",0,null,"IOMAF",null,null,"IOMAF",null,null,"PS",null,null,"PS"]
[null,null,null,null,null,null,null,"BE",{"$f":"I10/31","v":{"$error":"#REF!"}},null,"PS",0,null,"CDS/PP",null,null,"IOMAF",null,null,"PPD/PSD",null,null,"PPD/PSD"]
[null,null,null,null,null,null,null,"PAN",{"$f":"I11/31","v":{"$error":"#REF!"}},null,"CDU",0,null,"PS",null,null,"CDS/PP",null,null,"CDU",null,null,"CDU"]
[null,null,null,null,null,null,null,"PPD/PSD",{"$f":"I7/32","v":{"$error":"#REF!"}},null,"BE",0,null,"PPD/PSD",null,null,"PS",null,null,"BE",null,null,"BE"]
[null,null,null,null,null,null,null,"IOMAF",{"$f":"I8/32","v":{"$error":"#REF!"}},null,"PAN",0,null,"CDU",null,null,"PPD/PSD",null,null,"IOMAF",null,null,"IOMAF"]
[null,null,null,null,null,null,null,"CDS/PP",{"$f":"I9/32","v":{"$error":"#REF!"}},null,"PPD/PSD",0,null,"BE",null,null,"CDU",null,null,"CDS/PP",null,null,"CDS/PP"]
[null,null,null,null,null,null,null,"PS",{"$f":"I10/32","v":{"$error":"#REF!"}},null,"IOMAF",0,null,"IOMAF",null,null,null,null,null,"PS"]
[null,null,null,null,null,null,null,"CDU",{"$f":"I11/32","v":{"$error":"#REF!"}},null,"MAIS OEIRAS",0,null,"CDS/PP",null,null,null,null,null,"PPD/PSD"]
[null,null,null,null,null,null,null,"BE",{"$f":"I7/33","v":{"$error":"#REF!"}},null,"CDU",0,null,"PS",null,null,null,null,null,"CDU"]
[null,null,null,null,null,null,null,"PAN",{"$f":"I8/33","v":{"$error":"#REF!"}},null,"PS",0,null,"PPD/PSD",null,null,null,null,null,"BE"]
[null,null,null,null,null,null,null,"PPD/PSD",{"$f":"I9/33","v":{"$error":"#REF!"}},null,"BE",0,null,"CDU",null,null,null,null,null,"IOMAF"]
[null,null,null,null,null,null,null,"IOMAF",{"$f":"I10/33","v":{"$error":"#REF!"}},null,"IOMAF",0,null,"BE",null,null,null,null,null,"CDS/PP"]
[null,null,null,null,null,null,null,"CDS/PP",{"$f":"I11/33","v":{"$error":"#REF!"}},null,"MAIS OEIRAS",0,null,"IOMAF",null,null,null,null,null,"PS"]
[null,null,null,null,null,null,null,"PS",{"$f":"I7/34","v":{"$error":"#REF!"}},null,"CDU",0,null,"IOMAF",null,null,null,null,null,"PPD/PSD"]
[null,null,null,null,null,null,null,"CDU",{"$f":"I8/34","v":{"$error":"#REF!"}},null,"PS",0,null,"CDS/PP",null,null,null,null,null,"CDU"]
[null,null,null,null,null,null,null,"BE",{"$f":"I9/34","v":{"$error":"#REF!"}},null,"BE",0,null,"PS",null,null,null,null,null,"BE"]
[null,null,null,null,null,null,null,"PAN",{"$f":"I10/34","v":{"$error":"#REF!"}},null,"BE",0,null,"PPD/PSD",null,null,null,null,null,"IOMAF"]
[null,null,null,null,null,null,null,"PPD/PSD",{"$f":"I11/34","v":{"$error":"#REF!"}},null,"PPM",0,null,"CDU",null,null,null,null,null,"CDS/PP"]

{"sheet":"Cálculo","index":3,"n_rows":34,"n_cols":18,"rows_kept":34,"cut":false,"hidden":true,"merged":[[7,14,7,17],[10,1,10,11],[10,15,10,17],[1,1,1,11],[2,1,3,1],[3,14,3,17],[4,14,4,17],[6,1,6,11],[6,14,6,17]]}
[]
[null,"Votos",null,null,null,null,null,null,null,null,null,null,"Total:",{"$f":"SUM(C5:N5)","v":8594}]
[null,"Listas",1,2,3,4,5,6,7,8,9,10,11,12]
[null,null,{"$f":"Apuram!$A12","v":"L"},{"$f":"Apuram!$A13","v":"MPT"},{"$f":"Apuram!$A14","v":"PCTP/MRPP"},{"$f":"Apuram!$A15","v":"R.I.R."},{"$f":"Apuram!$A16","v":"B.E."},{"$f":"Apuram!$A17","v":"NC"},{"$f":"Apuram!$A18","v":"E"},{"$f":"Apuram!$A19","v":"A"},{"$f":"Apuram!$A20","v":"ADN"},null,null,null,"1. Inserir Nomes"]
[null,"Votos",{"$f":"Apuram!$L12","v":2967},{"$f":"Apuram!$L13","v":106},{"$f":"Apuram!$L14","v":255},{"$f":"Apuram!$L15","v":196},{"$f":"Apuram!$L16","v":4554},{"$f":"Apuram!$L17","v":72},{"$f":"Apuram!$L18","v":42},{"$f":"Apuram!$L19","v":72},{"$f":"Apuram!$L20","v":330},null,null,null,"2. Inserir Votação"]
[null,"%",{"$f":"IF(C5=\"\",\"\",C5/$N$2)","v":0.34524086572026996},{"$f":"IF(D5=\"\",\"\",D5/$N$2)","v":1.2334186641843147E-2},2.9671864091226439E-2,2.2806609262276005E-2,0.52990458459390277,8.3779380963462883E-3,4.8871305562020011E-3,8.3779380963462883E-3,3.8398882941587151E-2,"","",""]
[null,"Eleitos",null,null,null,null,null,null,null,null,null,null,"Total:",11,"3. Inserir Nº Eleitos"]
[null,"Eleitos",{"$f":"IF(COUNTIF($R:$R,C4)=0,\"\",COUNTIF($R:$R,C4))","v":4},"","","",7,"","","","","","","","4. Ler a Distribuição"]
[null,"%",{"$f":"IF(C8=\"\",\"\",C8/$N$7)","v":0.36363636363636365},"","","",0.63636363636363635,"","","","","","",""]
[]
[null,"Cálculos Auxiliares",null,null,null,null,null,null,null,null,null,null,"Mínimo:",{"$f":"SMALL(O:O,1)","v":650.57199628653052},"Coef","# Lista"]
[null,1,{"$f":"IF(C$5=\"\",\"\",IF($N$7>=$B12,C$5/$B12+0.0001+0.0001*RAND(),\"\"))","v":2967.0001384671109},{"$f":"IF(D$5=\"\",\"\",IF($N$7>=$B12,D$5/$B12+0.0002+0.0001*RAND(),\"\"))","v":106.000204827883},{"$f":"IF(E$5=\"\",\"\",IF($N$7>=$B12,E$5/$B12+0.0003+0.0001*RAND(),\"\"))","v":255.00037029553303},{"$f":"IF(F$5=\"\",\"\",IF($N$7>=$B12,F$5/$B12+0.0004+0.0001*RAND(),\"\"))","v":196.000466917344},{"$f":"IF(G$5=\"\",\"\",IF($N$7>=$B12,G$5/$B12+0.0005+0.0001*RAND(),\"\"))","v":4554.0005561503231},{"$f":"IF(H$5=\"\",\"\",IF($N$7>=$B12,H$5/$B12+0.0006+0.0001*RAND(),\"\"))","v":72.000651599895477},{"$f":"IF(I$5=\"\",\"\",IF($N$7>=$B12,I$5/$B12+0.0007+0.0001*RAND(),\"\"))","v":42.00076713806822},{"$f":"IF(J$5=\"\",\"\",IF($N$7>=$B12,J$5/$B12+0.0008+0.0001*RAND(),\"\"))","v":72.000898971543904},{"$f":"IF(K$5=\"\",\"\",IF($N$7>=$B12,K$5/$B12+0.0009+0.0001*RAND(),\"\"))","v":330.00093520465737},{"$f":"IF(L$5=\"\",\"\",IF($N$7>=$B12,L$5/$B12+0.001+0.0001*RAND(),\"\"))","v":""},{"$f":"IF(M$5=\"\",\"\",IF($N$7>=$B12,M$5/$B12+0.0011+0.0001*RAND(),\"\"))","v":""},{"$f":"IF(N$5=\"\",\"\",IF($N$7>=$B12,N$5/$B12+0.0012+0.0001*RAND(),\"\"))","v":""},{"$f":"IF(B12>$N$7,\"\",LARGE($C$12:$N$25,B12))","v":4554.0005561503231},{"$f":"IF(COUNTIF($C$12:$C$25,O12)=1,$C$4,IF(COUNTIF($D$12:$D$25,O12)=1,$D$4,IF(COUNTIF($E$12:$E$25,O12)=1,$E$4,IF(COUNTIF($F$12:$F$25,O12)=1,$F$4,IF(COUNTIF($G$12:$G$25,O12)=1,$G$4,IF(COUNTIF($H$12:$H$25,O12)=1,$H$4,\"\"))))))","v":"B.E."},{"$f":"IF(COUNTIF($I$12:$I$25,O12)=1,$I$4,IF(COUNTIF($J$12:$J$25,O12)=1,$J$4,IF(COUNTIF($K$12:$K$25,O12)=1,$K$4,IF(COUNTIF($L$12:$L$25,O12)=1,$L$4,IF(COUNTIF($M$12:$M$25,O12)=1,$M$4,IF(COUNTIF($N$12:$N$25,O12)=1,$N$4,\"\"))))))","v":""},{"$f":"IF(O12=\"\",\"\",IF(P12=\"\",Q12,P12))","v":"B.E."}]
[null,{"$f":"IF(B12<$N$7,B12+1,\"\")","v":2},{"$f":"IF(C$5=\"\",\"\",IF($N$7>=$B13,C$5/$B13+0.0001+0.0001*RAND(),\"\"))","v":1483.5001309174074},{"$f":"IF(D$5=\"\",\"\",IF($N$7>=$B13,D$5/$B13+0.0002+0.0001*RAND(),\"\"))","v":53.000254006333044},{"$f":"IF(E$5=\"\",\"\",IF($N$7>=$B13,E$5/$B13+0.0003+0.0001*RAND(),\"\"))","v":127.50032938663433},{"$f":"IF(F$5=\"\",\"\",IF($N$7>=$B13,F$5/$B13+0.0004+0.0001*RAND(),\"\"))","v":98.000457348622362},{"$f":"IF(G$5=\"\",\"\",IF($N$7>=$B13,G$5/$B13+0.0005+0.0001*RAND(),\"\"))","v":2277.0005781685009},{"$f":"IF(H$5=\"\",\"\",IF($N$7>=$B13,H$5/$B13+0.0006+0.0001*RAND(),\"\"))","v":36.000696917392332},{"$f":"IF(I$5=\"\",\"\",IF($N$7>=$B13,I$5/$B13+0.0007+0.0001*RAND(),\"\"))","v":21.000707534597169},{"$f":"IF(J$5=\"\",\"\",IF($N$7>=$B13,J$5/$B13+0.0008+0.0001*RAND(),\"\"))","v":36.000872438466814},{"$f":"IF(K$5=\"\",\"\",IF($N$7>=$B13,K$5/$B13+0.0009+0.0001*RAND(),\"\"))","v":165.00097303647587},{"$f":"IF(L$5=\"\",\"\",IF($N$7>=$B13,L$5/$B13+0.001+0.0001*RAND(),\"\"))","v":""},{"$f":"IF(M$5=\"\",\"\",IF($N$7>=$B13,M$5/$B13+0.0011+0.0001*RAND(),\"\"))","v":""},{"$f":"IF(N$5=\"\",\"\",IF($N$7>=$B13,N$5/$B13+0.0012+0.0001*RAND(),\"\"))","v":""},{"$f":"IF(B13>$N$7,\"\",LARGE($C$12:$N$25,B13))","v":2967.0001384671109},"L",{"$f":"IF(COUNTIF($I$12:$I$25,O13)=1,$I$4,IF(COUNTIF($J$12:$J$25,O13)=1,$J$4,IF(COUNTIF($K$12:$K$25,O13)=1,$K$4,IF(COUNTIF($L$12:$L$25,O13)=1,$L$4,IF(COUNTIF($M$12:$M$25,O13)=1,$M$4,IF(COUNTIF($N$12:$N$25,O13)=1,$N$4,\"\"))))))","v":""},{"$f":"IF(O13=\"\",\"\",IF(P13=\"\",Q13,P13))","v":"L"}]
[null,{"$f":"IF(B13<$N$7,B13+1,\"\")","v":3},989.00017802737977,35.333630516705497,85.000325870131149,65.333767284093383,1518.0005642577148,24.000605508386297,14.000760698708275,24.000856682746623,110.00098416589111,"","","",{"$f":"IF(B14>$N$7,\"\",LARGE($C$12:$N$25,B14))","v":2277.0005781685009},"B.E.","","B.E."]
[null,4,741.75010056347298,26.500238606738826,63.750369672779101,49.000473171419948,1138.5005242145692,18.000647457014345,10.500706550460762,18.000875915119032,82.500970211120915,"","","",1518.0005642577148,"B.E.",{"$f":"IF(COUNTIF($I$12:$I$25,O15)=1,$I$4,IF(COUNTIF($J$12:$J$25,O15)=1,$J$4,IF(COUNTIF($K$12:$K$25,O15)=1,$K$4,IF(COUNTIF($L$12:$L$25,O15)=1,$L$4,IF(COUNTIF($M$12:$M$25,O15)=1,$M$4,IF(COUNTIF($N$12:$N$25,O15)=1,$N$4,\"\"))))))","v":""},{"$f":"IF(O15=\"\",\"\",IF(P15=\"\",Q15,P15))","v":"B.E."}]
[null,5,593.40010023374839,21.200293520502107,51.00033110951707,39.200453689175411,910.80054344654309,14.400672939652734,8.4007836222019669,14.400826157965444,66.000938747198262,"","","",1483.5001309174074,"L","",{"$f":"IF(O16=\"\",\"\",IF(P16=\"\",Q16,P16))","v":"L"}]
[null,6,494.50015267227241,17.666925394959652,42.500343711152823,32.667132564387778,759.00053067745318,12.000607849203472,7.0007149029263003,12.000873718472015,55.000996019469071,"","","",1138.5005242145692,"B.E.","","B.E."]
[null,7,423.85729085219225,15.143117108970321,36.428922614485849,28.000441784614097,650.57199628653052,10.286320647026443,6.0007368231750347,10.286548475945505,47.143774351870533,"","","",989.00017802737977,"L","",{"$f":"IF(O18=\"\",\"\",IF(P18=\"\",Q18,P18))","v":"L"}]
[null,8,370.87517757066468,13.250281777408961,31.875357028925318,24.500452700903672,569.25050509788775,9.0006104691737292,5.2507151724764221,9.0008646282236473,41.250933345056829,"","","",910.80054344654309,"B.E.","",{"$f":"IF(O19=\"\",\"\",IF(P19=\"\",Q19,P19))","v":"B.E."}]
[null,9,329.66678302889829,11.777984888208422,28.333635602084147,21.778251745849506,506.0005084163675,8.0006713934143239,4.6674562864407134,8.000845627829289,36.667616577481006,"","","",759.00053067745318,"B.E.",{"$f":"IF(COUNTIF($I$12:$I$25,O20)=1,$I$4,IF(COUNTIF($J$12:$J$25,O20)=1,$J$4,IF(COUNTIF($K$12:$K$25,O20)=1,$K$4,IF(COUNTIF($L$12:$L$25,O20)=1,$L$4,IF(COUNTIF($M$12:$M$25,O20)=1,$M$4,IF(COUNTIF($N$12:$N$25,O20)=1,$N$4,\"\"))))))","v":""},{"$f":"IF(O20=\"\",\"\",IF(P20=\"\",Q20,P20))","v":"B.E."}]
[null,10,296.7001387675399,10.600209696828808,25.500339345584074,19.600463261501357,455.40053563719073,7.2006998045832455,4.2007124594088907,7.2008809290702471,33.000971015332802,"","","",741.75010056347298,"L","","L"]
[null,11,269.72745653653521,9.6365879262288274,23.182194549651452,17.818623216124685,414.0005108798934,6.5460589046646183,3.8189780615503546,6.5463091567764637,30.000907947437394,"","","",650.57199628653052,"B.E.","","B.E."]
[null,"","","","","","","","","","","","","",{"$f":"IF(B23>$N$7,\"\",LARGE($C$12:$N$25,B23))","v":""},"","",""]
[null,"","","","","","","","","","","","","","","","",""]
[null,"","","","","","","","","","","","","","","",{"$f":"IF(COUNTIF($I$12:$I$25,O25)=1,$I$4,IF(COUNTIF($J$12:$J$25,O25)=1,$J$4,IF(COUNTIF($K$12:$K$25,O25)=1,$K$4,IF(COUNTIF($L$12:$L$25,O25)=1,$L$4,IF(COUNTIF($M$12:$M$25,O25)=1,$M$4,IF(COUNTIF($N$12:$N$25,O25)=1,$N$4,\"\"))))))","v":""},""]
[null,"","","","","","","","","","",null,null,null,"",null,null,""]
[null,"","","","","","","","","","",null,null,null,"",null,null,""]
[null,"","","","","","","","","","",null,null,null,"",null,null,""]
[null,"","","","","","","","","","",null,null,null,"",null,null,""]
[null,"","","","","","","","","","",null,null,null,""]
[null,"","","","","","","","","","",null,null,null,""]
[null,"","","","","","","","","",""]
[null,"","","","","","","","","",""]
[null,"","","","","","","","","",""]

{"sheet":"Gr_CM","index":4,"n_rows":46,"n_cols":15,"rows_kept":46,"cut":false,"hidden":true,"merged":[[39,0,39,2],[40,0,40,2],[5,0,5,2],[0,0,0,11],[1,0,1,11],[3,0,3,2],[4,0,4,2],[38,0,38,2]]}
["Apuramento Provisório do Concelho de Oeiras - 29 de Setembro de 2013"]
["Resultados da Eleição da Câmara Municipal"]
[]
["Total de Secções de Voto",null,null,{"$f":"COUNTIF(#REF!,\"<>0\")","v":{"$error":"#REF!"}}]
["Apuradas",null,null,{"$f":"COUNTIF(#REF!,\">0\")","v":{"$error":"#REF!"}}]
["Por Apurar",null,null,{"$f":"COUNTIF(#REF!,0)","v":{"$error":"#REF!"}}]
[]
["Inscritos","Votantes","Expressos","Nulos","Brancos","Abstenções","PS","PPD/PSD","PTP","IOMAF","PCTP/MRPP","BE","CDS/PP","PAN","CDU"]
[{"$f":"Apuram!$L6","v":146070},{"$f":"Apuram!$L7","v":97643},{"$f":"Apuram!$L8","v":95976},{"$f":"Apuram!$L9","v":1053},{"$f":"Apuram!$L10","v":614},{"$f":"Apuram!$L11","v":48427},{"$f":"Apuram!$L12","v":2967},{"$f":"Apuram!$L13","v":106},{"$f":"Apuram!$L14","v":255},{"$f":"Apuram!$L15","v":196},{"$f":"Apuram!$L16","v":4554},{"$f":"Apuram!$L17","v":72},{"$f":"Apuram!$L18","v":42},{"$f":"Apuram!$L19","v":72},{"$f":"Apuram!$L20","v":330}]
[null,{"$f":"IF(B9=0,0,B9/A9)","v":0.66846717327308824},{"$f":"IF(C9=0,0,C9/B9)","v":0.98292760361725884},{"$f":"IF(D9=0,0,D9/B9)","v":1.0784183197976301E-2},{"$f":"IF(E9=0,0,E9/B9)","v":6.2882131847649091E-3},{"$f":"IF(F9=0,0,F9/A9)","v":0.33153282672691176},{"$f":"IF(G9=0,0,G9/$B9)","v":3.0386202799995904E-2},1.0855872924838443E-3,2.6115543356922668E-3,2.0073123521399385E-3,4.6639288018598367E-2,7.3738004772487531E-4,4.301383611728439E-4,7.3738004772487531E-4,{"$f":"IF(O9=0,0,O9/$B9)","v":3.3796585520723451E-3}]
[null,null,null,null,null,"Mandatos",{"$f":"#REF!","v":{"$error":"#REF!"}},{"$f":"#REF!","v":{"$error":"#REF!"}},{"$f":"#REF!","v":{"$error":"#REF!"}},{"$f":"#REF!","v":{"$error":"#REF!"}},{"$f":"#REF!","v":{"$error":"#REF!"}},{"$f":"#REF!","v":{"$error":"#REF!"}},{"$f":"#REF!","v":{"$error":"#REF!"}},{"$f":"#REF!","v":{"$error":"#REF!"}},{"$f":"#REF!","v":{"$error":"#REF!"}}]
[]
[]
[]
[]
[]
[]
[]
[]
[]
[]
[]
[]
[]
[]
[]
[]
[]
[]
[]
[]
[]
[]
[]
[]
[]
["Assembleia Municipal"]
[]
["Total de Secções de Voto",null,null,{"$f":"COUNTIF(#REF!,\"<>0\")","v":{"$error":"#REF!"}}]
["Apuradas",null,null,{"$f":"COUNTIF(#REF!,\">0\")","v":{"$error":"#REF!"}}]
["Por Apurar",null,null,{"$f":"COUNTIF(#REF!,0)","v":{"$error":"#REF!"}}]
[]
["Inscritos","Votantes","Expressos","Nulos","Brancos","Abstenções","PS","PPD/PSD","PTP","IOMAF","PCTP/MRPP","BE","CDS/PP","PAN","CDU"]
[{"$f":"Apuram!#REF!","v":{"$error":"#REF!"}},{"$f":"Apuram!#REF!","v":{"$error":"#REF!"}},{"$f":"Apuram!#REF!","v":{"$error":"#REF!"}},{"$f":"Apuram!#REF!","v":{"$error":"#REF!"}},{"$f":"Apuram!#REF!","v":{"$error":"#REF!"}},{"$f":"Apuram!#REF!","v":{"$error":"#REF!"}},{"$f":"Apuram!#REF!","v":{"$error":"#REF!"}},{"$f":"Apuram!#REF!","v":{"$error":"#REF!"}},{"$f":"Apuram!#REF!","v":{"$error":"#REF!"}},{"$f":"Apuram!#REF!","v":{"$error":"#REF!"}},{"$f":"Apuram!#REF!","v":{"$error":"#REF!"}},{"$f":"Apuram!#REF!","v":{"$error":"#REF!"}},{"$f":"Apuram!#REF!","v":{"$error":"#REF!"}},{"$f":"Apuram!#REF!","v":{"$error":"#REF!"}},{"$f":"Apuram!#REF!","v":{"$error":"#REF!"}}]
[null,{"$f":"IF(B44=0,0,B44/A44)","v":{"$error":"#REF!"}},{"$f":"IF(C44=0,0,C44/B44)","v":{"$error":"#REF!"}},{"$f":"IF(D44=0,0,D44/B44)","v":{"$error":"#REF!"}},{"$f":"IF(E44=0,0,E44/B44)","v":{"$error":"#REF!"}},{"$f":"IF(F44=0,0,F44/A44)","v":{"$error":"#REF!"}},{"$f":"IF(G44=0,0,G44/$B44)","v":{"$error":"#REF!"}},{"$error":"#REF!"},{"$error":"#REF!"},{"$error":"#REF!"},{"$error":"#REF!"},{"$error":"#REF!"},{"$error":"#REF!"},{"$error":"#REF!"},{"$f":"IF(O44=0,0,O44/$B44)","v":{"$error":"#REF!"}}]
[null,null,null,null,null,"Mandatos",{"$f":"#REF!","v":{"$error":"#REF!"}},{"$f":"#REF!","v":{"$error":"#REF!"}},{"$f":"#REF!","v":{"$error":"#REF!"}},{"$f":"#REF!","v":{"$error":"#REF!"}},{"$f":"#REF!","v":{"$error":"#REF!"}},{"$f":"#REF!","v":{"$error":"#REF!"}},{"$f":"#REF!","v":{"$error":"#REF!"}},{"$f":"#REF!","v":{"$error":"#REF!"}},{"$f":"#REF!","v":{"$error":"#REF!"}}]

{"sheet":"Mandatos","index":5,"n_rows":26,"n_cols":12,"rows_kept":26,"cut":false,"hidden":true,"merged":[[24,0,24,2],[25,0,25,2],[2,1,2,5],[4,0,4,2],[6,0,6,2],[9,0,9,2],[8,0,8,2],[3,0,3,2],[13,0,13,2],[12,0,12,2],[17,0,17,2],[16,0,16,2],[22,0,22,2],[21,0,21,2]]}
[]
[]
[null,"Mandatos para o Município de Oeiras"]
["Partidos",null,null,"PS","PPD/PSD","PTP","IOMAF","PCTP/MRPP","BE","CDS/PP","PAN","CDU"]
["Mandatos CM",null,null,{"$f":"SumColor(#REF!)","v":{"$error":"#VALUE!"}},{"$f":"SumColor(#REF!)","v":{"$error":"#VALUE!"}},{"$f":"SumColor(#REF!)","v":{"$error":"#VALUE!"}},{"$f":"SumColor(#REF!)","v":{"$error":"#VALUE!"}},{"$f":"SumColor(#REF!)","v":{"$error":"#VALUE!"}},{"$f":"SumColor(#REF!)","v":{"$error":"#VALUE!"}},{"$f":"SumColor(#REF!)","v":{"$error":"#VALUE!"}},{"$f":"SumColor(#REF!)","v":{"$error":"#VALUE!"}},{"$f":"SumColor(#REF!)","v":{"$error":"#VALUE!"}}]
[]
["Mandatos",null,null,{"$f":"SumColor(#REF!)","v":{"$error":"#VALUE!"}},{"$f":"SumColor(#REF!)","v":{"$error":"#VALUE!"}},{"$f":"SumColor(#REF!)","v":{"$error":"#VALUE!"}},{"$f":"SumColor(#REF!)","v":{"$error":"#VALUE!"}},{"$f":"SumColor(#REF!)","v":{"$error":"#VALUE!"}},{"$f":"SumColor(#REF!)","v":{"$error":"#VALUE!"}},{"$f":"SumColor(#REF!)","v":{"$error":"#VALUE!"}}]
[]
["Partidos",null,null,"IOMAF","CDS/PP","PS","PPD/PSD","CDU","BE"]
["Mandatos AF Algés, LAV, CQD",null,null,{"$f":"SumColor(#REF!)","v":{"$error":"#VALUE!"}},{"$f":"SumColor(#REF!)","v":{"$error":"#VALUE!"}},{"$f":"SumColor(#REF!)","v":{"$error":"#VALUE!"}},{"$f":"SumColor(#REF!)","v":{"$error":"#VALUE!"}},{"$f":"SumColor(#REF!)","v":{"$error":"#VALUE!"}},{"$f":"SumColor(#REF!)","v":{"$error":"#VALUE!"}}]
[]
[]
["Partidos",null,null,"IOMAF","CDS/PP","PS","PPD/PSD","CDU","BE"]
["Mandatos",null,null,{"$f":"SumColor(D19:D31)","v":0},0,0,0,0,0]
[]
[]
["Partidos",null,null,"IOMAF","CDS/PP","PS","PPD/PSD","CDU","BE"]
["Mandatos",null,null,{"$f":"SumColor(D23:D41)","v":0},0,0,0,0,0]
[]
[]
[]
["Partidos",null,null,"IOMAF","CDS/PP","PS","PPD/PSD","CDU","BE","MMS","PAN","PTP"]
["Mandatos",null,null,{"$f":"SumColor(D28:D46)","v":0},0,0,0,0,0,0,0,0]
[]
["Mandatos",null,null,{"$f":"SumColor(D32:D44)","v":0},0,0,0,0,0,0,0]
["Partidos",null,null,"IOMAF","CDS/PP","PS","PPD/PSD","CDU","BE","MMS","PAN"]